{"text_format":"3","workbook":"xlsx","n_sheets":7,"sheets":["Calculator","SupLL","SupTabella","SupGen","Dwh_mig","Trads","TradsDB"],"not_rendered":{"charts":3,"images":28,"macros":1,"defined_names":79,"comments":2},"read":"whole","date_system":"1900"}

{"sheet":"Calculator","index":0,"n_rows":256,"n_cols":52,"rows_kept":256,"merged":[[2,3,2,11],[4,2,4,3],[4,4,4,5],[4,8,4,9],[4,10,4,11],[6,2,6,3],[6,4,6,11],[8,2,8,4],[8,5,8,6],[8,7,16,10],[10,2,10,4],[10,5,10,6],[12,2,12,4],[14,2,14,4],[14,5,14,6],[18,2,18,12],[20,2,22,4],[20,5,21,6],[20,7,21,8],[20,9,21,10],[20,11,22,12],[22,5,22,6],[22,7,22,8],[22,9,22,10],[23,2,24,4],[23,5,24,6],[23,7,24,8],[23,9,24,10],[23,11,24,12],[25,2,26,4],[25,5,26,6],[25,7,26,8],[25,9,26,10],[25,11,26,12],[29,5,29,12],[30,5,31,12],[32,2,33,2],[32,3,32,4],[32,5,33,5],[32,6,32,7],[32,8,32,9],[32,10,33,10],[32,11,33,12],[33,3,33,4],[33,6,33,7],[33,8,33,9],[34,3,34,4],[34,6,34,7],[34,8,34,9],[34,11,34,12],[35,3,35,4],[35,6,35,7],[35,8,35,9],[35,11,35,12],[36,3,36,4],[36,6,36,7],[36,8,36,9],[36,11,36,12],[37,3,37,4],[37,6,37,7],[37,8,37,9],[37,11,37,12],[38,3,38,4],[38,6,38,7],[38,8,38,9],[38,11,38,12],[39,3,39,4],[39,6,39,7],[39,8,39,9],[39,11,39,12],[40,3,40,4],[40,6,40,7],[40,8,40,9],[40,11,40,12],[41,3,41,4],[41,6,41,7],[41,8,41,9],[41,11,41,12],[42,3,42,4],[42,6,42,7],[42,8,42,9],[42,11,42,12],[43,3,43,4],[43,6,43,7],[43,8,43,9],[43,11,43,12],[44,3,44,4],[44,6,44,7],[44,8,44,9],[44,11,44,12],[45,3,45,4],[45,6,45,7],[45,8,45,9],[45,11,45,12],[46,3,46,4],[46,6,46,7],[46,8,46,9],[46,11,46,12],[47,3,47,4],[47,6,47,7],[47,8,47,9],[47,11,47,12],[48,3,48,4],[48,6,48,7],[48,8,48,9],[48,11,48,12],[49,3,49,4],[49,6,49,7],[49,8,49,9],[49,11,49,12],[50,3,50,4],[50,6,50,7],[50,8,50,9],[50,11,50,12],[51,3,51,4],[51,6,51,7],[51,8,51,9],[51,11,51,12],[52,3,52,4],[52,6,52,7],[52,8,52,9],[52,11,52,12],[53,3,53,4],[53,6,53,7],[53,8,53,9],[53,11,53,12],[54,3,54,4],[54,6,54,7],[54,8,54,9],[54,11,54,12],[55,3,55,4],[55,6,55,7],[55,8,55,9],[55,11,55,12],[56,3,56,4],[56,6,56,7],[56,8,56,9],[56,11,56,12],[57,3,57,4],[57,6,57,7],[57,8,57,9],[57,11,57,12],[58,3,58,4],[58,6,58,7],[58,8,58,9],[58,11,58,12],[59,3,59,4],[59,6,59,7],[59,8,59,9],[59,11,59,12],[60,3,60,4],[60,6,60,7],[60,8,60,9],[60,11,60,12],[61,3,61,4],[61,6,61,7],[61,8,61,9],[61,11,61,12],[62,3,62,4],[62,6,62,7],[62,8,62,9],[62,11,62,12],[63,3,63,4],[63,6,63,7],[63,8,63,9],[63,11,63,12],[64,3,64,4],[64,6,64,7],[64,8,64,9],[64,11,64,12],[65,3,65,4],[65,6,65,7],[65,8,65,9],[65,11,65,12],[66,3,66,4],[66,6,66,7],[66,8,66,9],[66,11,66,12],[67,3,67,4],[67,6,67,7],[67,8,67,9],[67,11,67,12],[68,3,68,4],[68,6,68,7],[68,8,68,9],[68,11,68,12],[69,3,69,4],[69,6,69,7],[69,8,69,9],[69,11,69,12],[70,3,70,4],[70,6,70,7],[70,8,70,9],[70,11,70,12],[71,3,71,4],[71,6,71,7],[71,8,71,9],[71,11,71,12],[72,3,72,4],[72,6,72,7],[72,8,72,9],[72,11,72,12],[73,3,73,4],[73,6,73,7],[73,8,73,9],[73,11,73,12],[74,3,74,4],[74,6,74,7],[74,8,74,9],[74,11,74,12],[75,3,75,4],[75,6,75,7],[75,8,75,9],[75,11,75,12],[76,3,76,4],[76,6,76,7],[76,8,76,9],[76,11,76,12],[77,3,77,4],[77,6,77,7],[77,8,77,9],[77,11,77,12],[78,3,78,4],[78,6,78,7],[78,8,78,9],[78,11,78,12],[79,3,79,4],[79,6,79,7],[79,8,79,9],[79,11,79,12],[80,3,80,4],[80,6,80,7],[80,8,80,9],[80,11,80,12],[81,3,81,4],[81,6,81,7],[81,8,81,9],[81,11,81,12],[82,3,82,4],[82,6,82,7],[82,8,82,9],[82,11,82,12],[83,3,83,4],[83,6,83,7],[83,8,83,9],[83,11,83,12],[84,3,84,4],[84,6,84,7],[84,8,84,9],[84,11,84,12],[85,3,85,4],[85,6,85,7],[85,8,85,9],[85,11,85,12],[86,3,86,4],[86,6,86,7],[86,8,86,9],[86,11,86,12],[87,3,87,4],[87,6,87,7],[87,8,87,9],[87,11,87,12],[88,3,88,4],[88,6,88,7],[88,8,88,9],[88,11,88,12],[89,3,89,4],[89,6,89,7],[89,8,89,9],[89,11,89,12],[90,3,90,4],[90,6,90,7],[90,8,90,9],[90,11,90,12],[91,3,91,4],[91,6,91,7],[91,8,91,9],[91,11,91,12],[92,3,92,4],[92,6,92,7],[92,8,92,9],[92,11,92,12],[93,3,93,4],[93,6,93,7],[93,8,93,9],[93,11,93,12],[94,3,94,4],[94,6,94,7],[94,8,94,9],[94,11,94,12],[95,3,95,4],[95,6,95,7],[95,8,95,9],[95,11,95,12],[96,3,96,4],[96,6,96,7],[96,8,96,9],[96,11,96,12],[101,2,101,4],[101,5,101,6],[103,2,103,4],[103,5,103,6],[105,2,105,6],[105,7,105,8],[107,2,107,12],[108,2,109,3],[108,4,108,6],[108,7,108,9],[108,10,108,12],[110,2,110,3],[110,10,111,10],[110,11,111,11],[110,12,111,12],[111,2,111,3],[113,2,113,4],[113,5,113,6],[113,7,113,12],[115,7,115,9],[115,10,115,12],[117,7,117,9],[117,10,117,12],[120,2,120,12],[122,39,122,40],[122,41,122,42],[130,40,130,41],[133,38,133,39],[143,2,143,12],[144,2,144,12],[185,2,185,3],[187,24,187,25],[189,16,189,17],[190,16,190,17],[191,16,191,17],[192,16,192,17],[193,16,193,17],[194,16,194,17],[195,16,195,17],[196,16,196,17],[197,16,197,17],[198,16,198,17],[199,16,199,17],[200,16,200,17],[201,16,201,17],[202,16,202,17],[203,16,203,17],[204,16,204,17],[205,16,205,17],[206,16,206,17],[207,16,207,17],[208,16,208,17],[209,16,209,17],[210,16,210,17],[211,16,211,17],[212,16,212,17],[213,16,213,17],[214,16,214,17],[215,16,215,17],[216,16,216,17],[217,16,217,17],[218,16,218,17],[219,16,219,17],[220,16,220,17],[221,16,221,17],[222,16,222,17],[223,16,223,17],[224,16,224,17],[225,16,225,17],[226,16,226,17],[227,16,227,17],[228,16,228,17],[229,16,229,17],[230,16,230,17],[231,16,231,17],[232,16,232,17],[233,16,233,17],[234,16,234,17],[235,16,235,17],[236,16,236,17],[237,16,237,17],[238,16,238,17],[239,16,239,17],[240,16,240,17],[241,16,241,17],[242,16,242,17],[243,16,243,17],[244,16,244,17],[245,16,245,17],[246,16,246,17],[247,16,247,17],[248,16,248,17],[249,16,249,17],[250,16,250,17],[251,16,251,17],[252,16,252,17]]}
[]
[]
[{"$nulls":3},{"$f":"+Trads!A602","v":"Forze e deformazione del sistema"},{"$nulls":23},{"$f":"+IF(OR(F9=\"\",F11=\"\",AND(F9=\"TOWER / TOWERXL\",F11=\"SPEAREVO\")),\"FALSO\",_xlfn.CONCAT(F9,\"+\",F11))","v":"FALSO"}]
[]
[null,null,{"$f":"+Trads!$A$4","v":"Lingua"},null,"Italiano",{"$nulls":3},{"$f":"+Trads!A115","v":"Data"},null,{"$f":"TODAY()","v":"2023-10-10"}]
[]
[null,null,{"$f":"+Trads!A6","v":"Rif. Progetto"}]
[]
[null,null,{"$f":"PROPER(+Trads!A2)","v":"Supporto"}]
[]
[null,null,{"$f":"PROPER(+Trads!A603)","v":"Assorbitore-Tensionatore"},{"$nulls":24},{"$f":"+_xlfn.CONCAT(Trads!A372,\" \",Trads!A373)","v":"Stampa Relazione Tecnica"}]
[]
[null,null,{"$f":"PROPER(+Trads!A605)","v":"Numero Max Di Utenti"},null,null,{"$f":"_xlfn.IFNA(+VLOOKUP(F9,DB_Supporti,SupGen!Q11,FALSE),\"\")","v":""}]
[]
[]
[]
[]
[]
[null,null,{"$f":"+Trads!A606","v":"Carichi da manuale di installazione (EN795)"}]
[]
{"$rows_left_out":206}
{"sheet":"SupLL","index":1,"n_rows":358,"n_cols":62,"rows_kept":358,"hidden":true,"merged":[[5,2,5,9],[6,2,6,9],[8,2,8,3],[8,4,8,10],[10,2,10,3],[10,4,10,5],[11,2,11,3],[11,4,11,5],[13,2,13,3],[13,4,13,5],[13,6,13,8],[17,4,17,5],[19,1,19,6],[20,1,21,2],[20,6,21,6],[22,1,22,2],[23,1,23,2],[30,2,30,7],[38,1,38,5],[39,1,39,5],[39,9,39,11],[40,1,40,5],[40,9,40,11],[98,1,98,2],[98,4,98,5],[99,1,99,2],[99,4,99,5],[102,1,102,11],[103,1,104,2],[103,3,103,5],[103,6,103,8],[103,9,103,11],[105,9,106,9],[105,10,106,10],[105,11,106,11],[110,1,110,3],[110,5,110,6],[112,1,112,4],[113,1,113,2],[113,3,113,4],[113,5,114,6],[114,1,114,2],[114,3,114,4],[146,2,146,8],[149,3,149,6],[150,3,150,4],[150,5,150,6],[155,2,155,8],[177,2,177,8],[281,1,282,1]]}
[]
[]
[]
[{"$nulls":10},"LIFELINE v1.04",{"$nulls":14},0,0,null,"Rothoblaas CABLE","Ø8 - 7 x 7 - stainless steel - AISI316",{"$nulls":4},"CC ID"]
[{"$nulls":20},">",null,"SPEAR2/SPEAR","SPEAR_SPEAR2.txt",null,1,12,null,"user *","input data --->",null,null,"INDEFORMABILE","INDEFORMABILE","N.S."]
[null,null,"LIFELINE SYSTEMS CALCULATION",{"$nulls":17},"<",{"$nulls":4},2,13,null,{"$f":"IF(E14=AC5,\"uservalues\",\"Rbcable\")","v":"Rbcable"},{"$nulls":3},"TOWER300","TOWER300.txt","002",null,"PATROL + SPEAR"]
[null,null,"Forces and deflection of the system",{"$nulls":17},"Λ",{"$nulls":4},3,14,{"$nulls":5},"TOWER400","TOWER400.txt","004",null,"PATROL + SPEAREVO"]
[{"$nulls":20},"V",{"$nulls":4},4,15,{"$nulls":5},"TOWER500","TOWER500.txt","005"]
[null,null,"Project Name",null,"ABC",{"$nulls":15},"Angle",{"$nulls":11},"TOWER","TOWER600.txt","003"]
[{"$nulls":32},"PATROLEND","PATROLEND.txt","001"]
[null,null,"System",null,"PATROL + SPEAR",null,null,"Data:",{"$f":"TODAY()","v":"2023-10-10"},{"$nulls":16},"user",{"$f":"H18*SIGN(H18)","v":{"v":15,"d":"15.0 kN"}},{"$nulls":5},"PATROL OVERHEAD","PATROLEND.txt","001"]
[null,null,"Anchor Point",null,"TOWER",{"$nulls":15},"Loop",{"$nulls":11},"PATROL ON WALL","PATROLEND.txt","001"]
[{"$nulls":10},"Nominal diameter ",8,"mm",{"$nulls":19},"SHIELD | SHIELD2"]
[null,null,"Rope",null,"Rothoblaas CABLE",null,{"$f":"VLOOKUP(E14,AC4:AD5,2,)","v":"Ø8 - 7 x 7 - stainless steel - AISI316"},{"$nulls":3},"Fill ratio ",64,"%"]
[{"$nulls":10},"Apparent Young's Modulus ",110000,"N/mm2"]
[{"$nulls":10},"Specific weight",{"v":76977.1,"d":"76977"},"N/m3"]
[]
[null,null,"Max number of users",null,{"$f":"IF(E11=AK7,VLOOKUP(VLOOKUP(E12,AA100:AB107,2,FALSE),AA122:AE123,5,FALSE),VLOOKUP(VLOOKUP(E12,AA100:AB107,2,FALSE),AA111:AE113,5,FALSE))","v":4},null,null,{"v":-15,"d":"-15.0"},"kN"]
[]
[null,"Installation manual loads (EN795)"]
{"$rows_left_out":254}
{"sheet":"SupTabella","index":2,"n_rows":75,"n_cols":15,"rows_kept":75,"hidden":true,"merged":[[46,2,46,3],[54,2,54,3]]}
[]
[{"$nulls":3},"Orario","Antiorario"]
[null,"← (180°)",180,null,null,"TOWER300","TOWERA2300",null,null,"A2 (AISI 304)",null,{"$f":"+Trads!$A$345","v":"ZINCATO A CALDO"}]
[null,"↑ (90°)",90,null,null,"TOWER400","TOWERA2400",null,null,"A4 (AISI316)",null,"A2 (AISI 304)"]
[null,"→ (0°)",0,null,null,"TOWER500","TOWERA2500"]
[null,"↓ (270°)",270,null,null,"TOWER600",{"$nulls":8},"PASINT"]
[null,{"$f":"+Trads!$A$332","v":"Angolo"},{"$nulls":3},"TOWER22500",{"$nulls":3},{"$f":"+IF($J$6=Zinc,tower,towera2)","v":"TOWERA2300"},{"$nulls":4},"PASINTA4"]
[null,{"$f":"+Trads!$A$331","v":"Loop"},{"$nulls":7},"TOWERA2400"]
[null,{"$f":"+Trads!$A$330","v":"Fine"},{"$nulls":7},"TOWERA2500",null,{"$f":"+Calculator!J7","v":0}]
[{"$nulls":10},"Intermedio",{"$f":"+Calculator!K5","v":45209}]
[null,{"$f":"+Trads!$A$335","v":"Partenza"},{"$nulls":8},"Angolo",{"$f":"+Calculator!F15","v":0},null,"PATROLINT",{"$f":"+IF(L9=inoxa2,\"PASINT\",\"PASINTA4\")","v":"PASINTA4"}]
[{"$nulls":13},"PATROLMED"]
[null,{"$f":"+Trads!$A$337","v":"Da Supporto #"},{"$nulls":9},{"$f":"+IF(L9=inoxa4,PT,TipSys)","v":"PASSANTE"}]
[{"$nulls":11},"NON PASSANTE"]
[]
[{"$nulls":11},{"$f":"+IF(L10=PT,O11,IntNPT)","v":"PATROLINT"}]
[null,{"$f":"+Dx","v":"→ (0°)"},{"$f":"+down","v":"↓ (270°)"},{"$f":"+sx","v":"← (180°)"},{"$f":"+up","v":"↑ (90°)"},null,"TOPLATE",null,null,{"$f":"+Trads!$A$348","v":"Terminali"},null,"PATROLMED"]
[null,{"$f":"+down","v":"↓ (270°)"},{"$f":"+sx","v":"← (180°)"},{"$f":"+up","v":"↑ (90°)"},{"$f":"+Dx","v":"→ (0°)"},null,"TOPLATE+TOPLATE2",null,null,{"$f":"+Trads!$A$349","v":"Tutti i supporti"}]
[null,{"$f":"+up","v":"↑ (90°)"},{"$f":"+Dx","v":"→ (0°)"},{"$f":"+down","v":"↓ (270°)"},{"$f":"+sx","v":"← (180°)"},null,"TOPLATE2",null,null,{"$f":"+Trads!$A$350","v":"n. supporti"}]
[null,{"$f":"+Angle","v":"Angolo"},{"$f":"+Angle","v":"Angolo"},{"$f":"+Angle","v":"Angolo"},{"$f":"+Angle","v":"Angolo"},null,"TOWERPEAK"]
{"$rows_left_out":56}
{"sheet":"SupGen","index":3,"n_rows":52,"n_cols":33,"rows_kept":52,"hidden":true,"merged":[[1,16,1,17],[1,18,1,19],[1,21,1,22],[1,23,1,24],[1,25,1,26],[1,27,1,28],[9,13,9,14],[9,21,9,22],[9,23,9,24],[9,25,9,26],[9,27,9,28],[10,21,10,22],[10,23,10,24],[10,25,10,26],[10,27,10,28]]}
[{"$nulls":13},{"$f":"+_xlfn.SEQUENCE(,20)","v":1},2,3,4,5,6,7,8,9,10,11,12,13,14,15,16,17,18,19,20]
[{"$nulls":16},"Operatori",null,"Interasse max",null,"Interasse min","Carico con Interasse Max",null,"Freccia con Interasse Max",null,"Carico con Interasse Min",null,"Freccia con Interasse Min"]
[{"$nulls":6},"A2",null,"A4",{"$nulls":7},"SPEAR","SPEAREVO","SPEAR","SPEAREVO",null,"SPEAR","SPEAREVO","SPEAR","SPEAREVO","SPEAR","SPEAREVO","SPEAR","SPEAREVO"]
[null,{"$f":"+Trads!$A$17","v":"PASSANTE"},{"$nulls":4},"PASINT",null,null,"SPEAR",null,"TOWER300",null,"TOWER / TOWERXL",{"$f":"+Spear","v":"SPEAR"},{"$error":"#N/A"},4,{"$error":"#N/A"},15,{"$error":"#N/A"},2,16.5,{"$error":"#N/A"},3.26,{"$error":"#N/A"},8.2,{"$error":"#N/A"},1.26,{"$error":"#N/A"}]
[null,{"$f":"+Trads!$A$18","v":"NON PASSANTE"},{"$nulls":7},"SPEAREVO",null,"TOWER400",null,"SHIELD / SHIELD2",{"$f":"+Spear","v":"SPEAR"},{"$f":"+Spearevo","v":"SPEAREVO"},2,4,7.5,15,2,17.1,{"$f":"+B52","v":13.7},1.44,{"$f":"+J51","v":3.4},12.5,5.7,0.62,1.35]
[{"$nulls":11},"TOWER500",null,"PATROLEND",{"$f":"+Spear","v":"SPEAR"},{"$f":"+Spearevo","v":"SPEAREVO"},4,4,7.5,15,2,18.1,14,1.3,3.4,14.2,5.7,0.55,1.35]
[{"$nulls":11},"TOWER600",null,"PATROL OVERHEAD","SPEAR",{"$f":"+Spearevo","v":"SPEAREVO"},4,4,7.5,15,2,18.1,14,1.3,3.4,14.2,5.7,0.55,1.35]
[{"$nulls":11},"PATROLEND",null,"PATROL ON WALL",{"$f":"+Spear","v":"SPEAR"},{"$f":"+Spearevo","v":"SPEAREVO"},4,4,7.5,15,2,18.1,14,1.3,3.4,14.2,5.7,0.55,1.35]
[null,{"$f":"+Trads!$A$19","v":"LEGNO"},{"$nulls":9},"PATROL OVERHEAD"]
[null,{"$f":"+Trads!$A$20","v":"CEMENTO"},{"$nulls":9},"PATROL ON WALL",null,"Dal Foglio Calc",null,null,"Operatori",null,"Interassi",null,null,"Carico Max",null,"Freccia Max",null,"Carico Min",null,"Freccia Max"]
[null,{"$f":"+Trads!$A$21","v":"ACCIAIO"},{"$nulls":9},"SHIELD | SHIELD2",null,{"$f":"+Calculator!F9","v":0},{"$f":"+Calculator!F11","v":0},null,{"$f":"IF(O11=Spear,4,5)","v":5},null,{"$f":"IF(O11=Spear,6,7)","v":7},null,null,{"$f":"IF(O11=Spear,9,10)","v":10},null,{"$f":"IF(O11=Spear,11,12)","v":12},null,{"$f":"IF(O11=Spear,13,14)","v":14},null,{"$f":"IF(O11=Spear,15,16)","v":16}]
[]
[{"$nulls":13},"AssorbitoreLista"]
[{"$nulls":13},{"$f":"+VLOOKUP(N11,N4:P8,2,FALSE)","v":{"$error":"#N/A"}}]
[{"$nulls":13},{"$f":"_xlfn.IFNA(VLOOKUP(N11,N4:P8,3,FALSE),\"\")","v":""}]
{"$rows_empty":12}
[{"$nulls":6},"TOWER300","TOWER"]
[{"$nulls":6},"TOWER400","TOWER"]
[{"$nulls":6},"TOWER500","TOWER"]
["PATROL + TOWER + SPEAR",null,"[4UTENTI]",{"$nulls":3},"TOWER","TOWER"]
{"$rows_left_out":22}
{"sheet":"Dwh_mig","index":4,"n_rows":37,"n_cols":4,"rows_kept":37,"hidden":true}
[]
["Descrizione Indice",{"$f":"+VLOOKUP(Calculator!E5,Dwh_mig!A3:B28,2,FALSE)","v":1},"Codice Lingua Sistema"]
["Italiano",1,1040,"Italiano"]
["čeština",2,1029,"Français"]
["汉语",3,2052,"English"]
["Hrvatski",4,1050,"Español"]
["Français",5,1036,"Deutsch"]
["日本",6,1041]
["Γκρέγκο",7,1032]
["English",8,1033]
["Latvietis",9,1062]
["Polski",10,1045]
["Português",11,2070]
["Română",12,1048]
["Русский",13,1049]
["Slovenčina",14,1051]
["Slovenščina",15,1060]
["Español",16,1034]
["Svenska",17,1053]
["Deutsch",18,1031]
{"$rows_left_out":18}
{"sheet":"Trads","index":5,"n_rows":1501,"n_cols":5,"rows_kept":1501,"hidden":true}
["Lingua Selezionata","#"]
[{"$f":"+INDEX(Traduzioni,,Dwh_mig!B2)","v":"SUPPORTO"},{"$f":"+_xlfn.SEQUENCE(1499,,2)","v":2},{"$f":"+_xlfn.CONCAT(\"Trads\",B2)","v":"Trads2"},null,{"$f":"+Dwh_mig!B2","v":1}]
["Listino Prezzi",3,{"$f":"+_xlfn.CONCAT(\"Trads\",B3)","v":"Trads3"}]
["Lingua",4,"Trads4"]
["Valuta",5,"Trads5"]
["Rif. Progetto",6,"Trads6"]
["SOTTOSTRUTTURA",7,"Trads7"]
["SUPPORTO PRINCIPALE",8,"Trads8"]
["COMPONENTI",9,"Trads9"]
["TIPO INTERMEDIO",10,"Trads10"]
["INTERMEDIO",11,"Trads11"]
["Codice",12,"Trads12"]
["TIPO ANGOLO",13,"Trads13"]
["TIPO NAVETTA",14,"Trads14"]
["NUMERO DI NAVETTE",15,"Trads15"]
["N. DI NAVETTE PER LINEA VITA",16,"Trads16"]
["PASSANTE",17,"Trads17"]
["NON PASSANTE",18,"Trads18"]
["LEGNO",19,"Trads19"]
["CEMENTO",20,"Trads20"]
{"$rows_left_out":1482}
{"sheet":"TradsDB","index":6,"n_rows":800,"n_cols":22,"rows_kept":800,"hidden":true}
["#",null,"Italiano","čeština","汉语","Hrvatski","Français","大和","Γκρέγκο","English","Latvietis","Polski","Português","Română","Русский","Slovenčina","Slovenščina","Español","Svenska","Deutsch","Türkçe","Magyar Nyelv"]
[2,{"$f":"+_xlfn.CONCAT(\"Trad\",A2)","v":"Trad2"},"SUPPORTO","PODPORA","支持","PODRŠKA","SOUTIEN","サポート","ΥΠΟΣΤΗΡΙΞΗ","SUPPORT","ATBALSTS","POMOC","APOIO","SUPORT","ПОДДЕРЖКА","PODPORA","PODPORA","SOPORTE","STÖD","GRUNDPLATTE","DESTEK","TÁMOGATÁS"]
[3,"Trad3","Listino Prezzi","Ceník","价格表","Cjenik","Liste des prix","価格表","Λίστα τιμών","Price List","Cenrādis","Cennik","Lista de preços","Lista de prețuri","Прайс-лист","Cenník","Cenik","Lista de precios","Prislista","Preislisten","Fiyat listesi","Árlista"]
[4,"Trad4","Lingua","Jazyk","语言","Jezik","Langue","言語","Γλώσσα","Language","Valoda","Język","Idioma","Limba","Язык","Jazyk","Jezik","Idioma","Språk","Sprache","Dilim","Nyelv"]
[5,"Trad5","Valuta","Měna","货币","Valuta","Devise","通貨","Νόμισμα","Currency","Valūta","Waluta","Moeda","Monedă","Валюта","Mena","Valuta","Moneda","Valuta","Währung","Para birimi","Pénznem"]
[6,"Trad6","Rif. Progetto","Projekt Ref.","项目编号。","Projekt Ref.","Réf. du projet","参照プロジェクト","Υπεύθυνος Έργου","Project Ref.","Projekta atsauces Nr.","Nr ref. projektu","Projecto Ref.","Proiect Ref.","Ссылка на проект.","Ref. projektu","Ref. projekta","Ref. del proyecto","Projekt Ref.","Projekt Ref.","Proje Referansı","Projekt Ref."]
[7,"Trad7","SOTTOSTRUTTURA","SUBSTRUKTURA","结构","PODSTRUKTURA","SUBSTRUCTURE","サブストラクチャー","ΥΠΟΔΟΜΗ","SUBSTRUCTURE","SUBSTRUKTŪRA","PODBUDOWA","SUBSTRUTURA","SUBSTRUCTURA","СУБСТРУКТУРА","SUBSTRUKTÚRA","SUBSTRUKCIJA","SUBESTRUCTURA","SUBSTRUKTUR","Unterkonstruktion","ALT YAPI","ALSZERKEZET"]
[8,"Trad8","SUPPORTO PRINCIPALE","HLAVNÍ PODPORA","主要支持","GLAVNA PODRŠKA","SUPPORT PRINCIPAL","メインサポート","ΚΥΡΙΑ ΥΠΟΣΤΗΡΙΞΗ","MAIN SUPPORT","GALVENIS ATBALSTS","WSPARCIE GŁÓWNE","APOIO PRINCIPAL","SUPORT PRINCIPAL","ГЛАВНАЯ ОПОРА","HLAVNÁ PODPORA","GLAVNA PODPORA","SOPORTE PRINCIPAL","HUVUDSTÖD","Grundplatte","ANA DESTEK","FŐ TÁMOGATÁS"]
[9,"Trad9","COMPONENTI","KOMPONENTY","构成部分","KOMPONENTE OD","COMPOSANTS DE","コンポーネント","ΣΥΣΤΑΤΙΚΑ ΤΗΣ","COMPONENTS OF","KOMPONENTI","CZĘŚCI","COMPONENTES DE","COMPONENTE DE","КОМПОНЕНТЫ","KOMPONENTY","SESTAVNI DELI","COMPONENTES","KOMPONENTER AV","Komponenten","IN BİLEŞENLERİ","ÖSSZETEVŐK"]
[10,"Trad10","TIPO INTERMEDIO","STŘEDOVÝ TYP","中间件类型","SREDNJI TIP","TYPE INTERMÉDIAIRE","中間タイプ","ΕΝΔΙΑΜΕΣΟΣ ΤΥΠΟΣ","INTERMEDIATE TYPE","STARPPOSMA TIPS","TYP POŚREDNI","TIPO INTERMÉDIO","TIP INTERMEDIAR","ПРОМЕЖУТОЧНЫЙ ТИП","PRECHODNÝ TYP","VMESNI TIP","TIPO INTERMEDIO","MELLAN TYP","Art des Zwischenstück","ARA TİP","KÖZTES TÍPUS"]
[11,"Trad11","INTERMEDIO","STŘEDOVÝ","中间的","SREDNJI","INTERMEDIAIRE","中間","ΕΝΔΙΑΜΕΣΟΣ","INTERMEDIATE","STARPPOSMS","MEDIATOR","INTERMÉDIO","INTERMEDIARĂ","ПРОМЕЖУТОЧНЫЙ","MEDZINÁRODNÝ","VMESNI","INTERMEDIO","MELLANLIGGANDE","Zwischenstück","ORTA DÜZEY","KÖZTES"]
[12,"Trad12","Codice","Kód","编码","Kod","Code","コード","Κώδικας","Code","Kods","Kod","Código","Cod","Код","Kód","Koda","Código","Koda","Kodex","kod","Kód"]
[13,"Trad13","TIPO ANGOLO","TYP ROHU","转角件类型","TIP UGLA","TYPE D'ANGLE","コーナータイプ","ΤΥΠΟΣ ΓΩΝΙΑΣ","CORNER TYPE","STŪRA TIPS","RODZAJ NAROŻNIKA","TIPO ÂNGULO","TIP COLȚAR","ТИП УГЛОВОЙ","ROHOVÝ TYP","VRTNI TIP","Tipo de ángulo","HÖRNTYP","Art des Winkels","KÖŞE TİPİ","SARKOS TÍPUS"]
[14,"Trad14","TIPO NAVETTA","TYP JEZDCE","滑梭类型","TIP TRANSPORTERA","TYPE DE BATEAU","シャトルタイプ","ΤΥΠΟΣ ΜΕΤΑΦΟΡΑΣ","SHUTTLE TYPE"," SLĪDŅA VEIDS","TYP WAHADŁOWY","TIPO DE SHUTTLE","TIPUL DE CUTREMUR","ТИП МАРШРУТКИ","TYP KRÁTKODOBÝ","VRSTA ZAVAROVANJA","TIPO DE carril","SHUTTLE TYPE","Art des Gleiters","mekik tipi","KOCSI TÍPUS"]
[15,"Trad15","NUMERO DI NAVETTE","POČET JEZDCŮ","滑梭的数量","NO. TRANSPORTERA","NB. DE BATEAUX","シャトルの番号","ΑΡ. ΜΕΤΑΦΟΡΩΝ","NO. OF SHUTTLES","SLĪDŅU SKAITS","NIE. WAŁÓWEK","NUM. DE SHUTTLE","NU. DE ȘOARETE","НЕТ. МАРШРУТОК","Č. ČÍSLA","NE. ŠKATLJEV","NÚMERO DE CARRILES","NEJ. AV FÖRBINDNINGAR","Nr/Anzahl des Gleiters","NUMARA. MERKEZLER","KOCSIK SZÁMA"]
[16,"Trad16","N. DI NAVETTE PER LINEA VITA","POČET JEZDCŮ NA LANKOVÝ SYSTÉM","生命线滑梭数量","NO. TRANSPORTERA ZA LINIJU ŽIVOTA","NO. DE NAVETTES POUR LES LIGNES DE VIE","ライフライン用シャトルの番号","ΑΡ. ΜΕΤΑΦΟΡΩΝ ΓΙΑ ΓΡΑΜΜΕΣ ΖΩΗΣ","NO. OF SHUTTLES FOR LIFE LINES","SLĪDŅU SKAITS DROŠĪBAS LĪNIJAI","NIE. WACHTÓW NA LINIE ŻYCIA","NUM. DE SHUTTLES PARA LINHAS DE VIDA","NR. DE NAVETE PENTRU LINII DE VIAȚĂ","NO. ЧЕЛНОКОВ ДЛЯ СПАСАТЕЛЬНЫХ ЛИНИЙ","Č. RAKETOPLÁNOV PRE LINKY ZÁCHRANY","NO. ČOLNOV ZA REŠILNE PROGE","NUM.CARRILES PARA LÍNEAS","NEJ. AV SKYDD FÖR LIVSLINJER","Nr/Anzahl der Gleiter für Lebenslinien","NUMARA. YAŞAM HATLARI İÇİN MERKEZLER","KÁBELES RENDSZEREKHEZ SZÜKSÉGES KOCSIK SZÁMA"]
[17,"Trad17","PASSANTE","PRŮBĚŽNÝ","可通过","PROLAZNA","PASSANT À TRAVERS","通過できる","ΔΙΕΡΧΕΤΑΙ","PASSING THROUGH","ŠKĒRSOJAMAS","PRZEJAZDEM","PASSANTE","CARE TREC PRIN","ПРОХОДЯЩИЙ","PRECHÁDZAJÚCE","KI POTEKAJO SKOZI","Pasante","PASSERAR GENOM","DURCHLAUFEND","İÇİNDEN GEÇMEK","ÁTJÁRHATÓ"]
[18,"Trad18","NON PASSANTE","NEPRŮBĚŽNÝ","不可通过","NIJE  PROLAZNA","NE PASSANT PAS À TRAVERS","通過できない","ΔΕΝ ΔΙΕΡΧΕΤΑΙ","NOT PASSING TROUGH","NEŠĶĒRSOJAMAS","NIE PRZECHODZĄ","NÃO PASSANTE","CARE NU TREC PRIN PASAJ","НЕ ПРОХОДЯЩИЙ ЖЕЛОБ","NEPRECHÁDZAJÚCE KORYTOM","KI NE POTEKAJO SKOZI KORITO","No pasante","GÅR INTE GENOM","NICHT DURCHLAUFEND","GEÇMİYOR","NEM ÁTJÁRHAT"]
[19,"Trad19","LEGNO","DŘEVO","木材","DRVO","TIMBRE","木材","ΞΥΛΕΙΑ","TIMBER","KOKS","DREWNO","MADEIRA","TIMBRUL","БРУСЧАТКА","DREVO","TIMBER","MADERA","TIMMER","HOLZ","KERESTE","FA"]
[20,"Trad20","CEMENTO","BETON","混凝土","BETON","BÉTON","コンクリート","ΣΚΥΡΟΔΕΜΑ","CONCRETE","BETONS","BETON","BETÃO","BETON","КОНКРЕТ","BETÓN","BETON","HORMIGÓN","BETONG","BETON","BETON","BETON"]
{"$rows_left_out":780}