{"text_format":"3","workbook":"xlsx","n_sheets":7,"sheets":["Calculator","SupLL","SupTabella","SupGen","Dwh_mig","Trads","TradsDB"],"not_rendered":{"charts":3,"images":28,"macros":1,"defined_names":79,"comments":2},"read":"whole","date_system":"1900"}

{"sheet":"Calculator","index":0,"n_rows":256,"n_cols":52,"rows_kept":256,"merged":[[2,3,2,11],[4,2,4,3],[4,4,4,5],[4,8,4,9],[4,10,4,11],[6,2,6,3],[6,4,6,11],[8,2,8,4],[8,5,8,6],[8,7,16,10],[10,2,10,4],[10,5,10,6],[12,2,12,4],[14,2,14,4],[14,5,14,6],[18,2,18,12],[20,2,22,4],[20,5,21,6],[20,7,21,8],[20,9,21,10],[20,11,22,12],[22,5,22,6],[22,7,22,8],[22,9,22,10],[23,2,24,4],[23,5,24,6],[23,7,24,8],[23,9,24,10],[23,11,24,12],[25,2,26,4],[25,5,26,6],[25,7,26,8],[25,9,26,10],[25,11,26,12],[29,5,29,12],[30,5,31,12],[32,2,33,2],[32,3,32,4],[32,5,33,5],[32,6,32,7],[32,8,32,9],[32,10,33,10],[32,11,33,12],[33,3,33,4],[33,6,33,7],[33,8,33,9],[34,3,34,4],[34,6,34,7],[34,8,34,9],[34,11,34,12],[35,3,35,4],[35,6,35,7],[35,8,35,9],[35,11,35,12],[36,3,36,4],[36,6,36,7],[36,8,36,9],[36,11,36,12],[37,3,37,4],[37,6,37,7],[37,8,37,9],[37,11,37,12],[38,3,38,4],[38,6,38,7],[38,8,38,9],[38,11,38,12],[39,3,39,4],[39,6,39,7],[39,8,39,9],[39,11,39,12],[40,3,40,4],[40,6,40,7],[40,8,40,9],[40,11,40,12],[41,3,41,4],[41,6,41,7],[41,8,41,9],[41,11,41,12],[42,3,42,4],[42,6,42,7],[42,8,42,9],[42,11,42,12],[43,3,43,4],[43,6,43,7],[43,8,43,9],[43,11,43,12],[44,3,44,4],[44,6,44,7],[44,8,44,9],[44,11,44,12],[45,3,45,4],[45,6,45,7],[45,8,45,9],[45,11,45,12],[46,3,46,4],[46,6,46,7],[46,8,46,9],[46,11,46,12],[47,3,47,4],[47,6,47,7],[47,8,47,9],[47,11,47,12],[48,3,48,4],[48,6,48,7],[48,8,48,9],[48,11,48,12],[49,3,49,4],[49,6,49,7],[49,8,49,9],[49,11,49,12],[50,3,50,4],[50,6,50,7],[50,8,50,9],[50,11,50,12],[51,3,51,4],[51,6,51,7],[51,8,51,9],[51,11,51,12],[52,3,52,4],[52,6,52,7],[52,8,52,9],[52,11,52,12],[53,3,53,4],[53,6,53,7],[53,8,53,9],[53,11,53,12],[54,3,54,4],[54,6,54,7],[54,8,54,9],[54,11,54,12],[55,3,55,4],[55,6,55,7],[55,8,55,9],[55,11,55,12],[56,3,56,4],[56,6,56,7],[56,8,56,9],[56,11,56,12],[57,3,57,4],[57,6,57,7],[57,8,57,9],[57,11,57,12],[58,3,58,4],[58,6,58,7],[58,8,58,9],[58,11,58,12],[59,3,59,4],[59,6,59,7],[59,8,59,9],[59,11,59,12],[60,3,60,4],[60,6,60,7],[60,8,60,9],[60,11,60,12],[61,3,61,4],[61,6,61,7],[61,8,61,9],[61,11,61,12],[62,3,62,4],[62,6,62,7],[62,8,62,9],[62,11,62,12],[63,3,63,4],[63,6,63,7],[63,8,63,9],[63,11,63,12],[64,3,64,4],[64,6,64,7],[64,8,64,9],[64,11,64,12],[65,3,65,4],[65,6,65,7],[65,8,65,9],[65,11,65,12],[66,3,66,4],[66,6,66,7],[66,8,66,9],[66,11,66,12],[67,3,67,4],[67,6,67,7],[67,8,67,9],[67,11,67,12],[68,3,68,4],[68,6,68,7],[68,8,68,9],[68,11,68,12],[69,3,69,4],[69,6,69,7],[69,8,69,9],[69,11,69,12],[70,3,70,4],[70,6,70,7],[70,8,70,9],[70,11,70,12],[71,3,71,4],[71,6,71,7],[71,8,71,9],[71,11,71,12],[72,3,72,4],[72,6,72,7],[72,8,72,9],[72,11,72,12],[73,3,73,4],[73,6,73,7],[73,8,73,9],[73,11,73,12],[74,3,74,4],[74,6,74,7],[74,8,74,9],[74,11,74,12],[75,3,75,4],[75,6,75,7],[75,8,75,9],[75,11,75,12],[76,3,76,4],[76,6,76,7],[76,8,76,9],[76,11,76,12],[77,3,77,4],[77,6,77,7],[77,8,77,9],[77,11,77,12],[78,3,78,4],[78,6,78,7],[78,8,78,9],[78,11,78,12],[79,3,79,4],[79,6,79,7],[79,8,79,9],[79,11,79,12],[80,3,80,4],[80,6,80,7],[80,8,80,9],[80,11,80,12],[81,3,81,4],[81,6,81,7],[81,8,81,9],[81,11,81,12],[82,3,82,4],[82,6,82,7],[82,8,82,9],[82,11,82,12],[83,3,83,4],[83,6,83,7],[83,8,83,9],[83,11,83,12],[84,3,84,4],[84,6,84,7],[84,8,84,9],[84,11,84,12],[85,3,85,4],[85,6,85,7],[85,8,85,9],[85,11,85,12],[86,3,86,4],[86,6,86,7],[86,8,86,9],[86,11,86,12],[87,3,87,4],[87,6,87,7],[87,8,87,9],[87,11,87,12],[88,3,88,4],[88,6,88,7],[88,8,88,9],[88,11,88,12],[89,3,89,4],[89,6,89,7],[89,8,89,9],[89,11,89,12],[90,3,90,4],[90,6,90,7],[90,8,90,9],[90,11,90,12],[91,3,91,4],[91,6,91,7],[91,8,91,9],[91,11,91,12],[92,3,92,4],[92,6,92,7],[92,8,92,9],[92,11,92,12],[93,3,93,4],[93,6,93,7],[93,8,93,9],[93,11,93,12],[94,3,94,4],[94,6,94,7],[94,8,94,9],[94,11,94,12],[95,3,95,4],[95,6,95,7],[95,8,95,9],[95,11,95,12],[96,3,96,4],[96,6,96,7],[96,8,96,9],[96,11,96,12],[101,2,101,4],[101,5,101,6],[103,2,103,4],[103,5,103,6],[105,2,105,6],[105,7,105,8],[107,2,107,12],[108,2,109,3],[108,4,108,6],[108,7,108,9],[108,10,108,12],[110,2,110,3],[110,10,111,10],[110,11,111,11],[110,12,111,12],[111,2,111,3],[113,2,113,4],[113,5,113,6],[113,7,113,12],[115,7,115,9],[115,10,115,12],[117,7,117,9],[117,10,117,12],[120,2,120,12],[122,39,122,40],[122,41,122,42],[130,40,130,41],[133,38,133,39],[143,2,143,12],[144,2,144,12],[185,2,185,3],[187,24,187,25],[189,16,189,17],[190,16,190,17],[191,16,191,17],[192,16,192,17],[193,16,193,17],[194,16,194,17],[195,16,195,17],[196,16,196,17],[197,16,197,17],[198,16,198,17],[199,16,199,17],[200,16,200,17],[201,16,201,17],[202,16,202,17],[203,16,203,17],[204,16,204,17],[205,16,205,17],[206,16,206,17],[207,16,207,17],[208,16,208,17],[209,16,209,17],[210,16,210,17],[211,16,211,17],[212,16,212,17],[213,16,213,17],[214,16,214,17],[215,16,215,17],[216,16,216,17],[217,16,217,17],[218,16,218,17],[219,16,219,17],[220,16,220,17],[221,16,221,17],[222,16,222,17],[223,16,223,17],[224,16,224,17],[225,16,225,17],[226,16,226,17],[227,16,227,17],[228,16,228,17],[229,16,229,17],[230,16,230,17],[231,16,231,17],[232,16,232,17],[233,16,233,17],[234,16,234,17],[235,16,235,17],[236,16,236,17],[237,16,237,17],[238,16,238,17],[239,16,239,17],[240,16,240,17],[241,16,241,17],[242,16,242,17],[243,16,243,17],[244,16,244,17],[245,16,245,17],[246,16,246,17],[247,16,247,17],[248,16,248,17],[249,16,249,17],[250,16,250,17],[251,16,251,17],[252,16,252,17]]}
[]
[]
[{"$nulls":3},{"$f":"+Trads!A602","v":"Forze e deformazione del sistema"},{"$nulls":23},{"$f":"+IF(OR(F9=\"\",F11=\"\",AND(F9=\"TOWER / TOWERXL\",F11=\"SPEAREVO\")),\"FALSO\",_xlfn.CONCAT(F9,\"+\",F11))","v":"FALSO"}]
[]
[null,null,{"$f":"+Trads!$A$4","v":"Lingua"},null,"Italiano",{"$nulls":3},{"$f":"+Trads!A115","v":"Data"},null,{"$f":"TODAY()","v":"2023-10-10"}]
[]
[null,null,{"$f":"+Trads!A6","v":"Rif. Progetto"}]
[]
[null,null,{"$f":"PROPER(+Trads!A2)","v":"Supporto"}]
[]
[null,null,{"$f":"PROPER(+Trads!A603)","v":"Assorbitore-Tensionatore"},{"$nulls":24},{"$f":"+_xlfn.CONCAT(Trads!A372,\" \",Trads!A373)","v":"Stampa Relazione Tecnica"}]
[]
[null,null,{"$f":"PROPER(+Trads!A605)","v":"Numero Max Di Utenti"},null,null,{"$f":"_xlfn.IFNA(+VLOOKUP(F9,DB_Supporti,SupGen!Q11,FALSE),\"\")","v":""}]
[]
[]
[]
[]
[]
[null,null,{"$f":"+Trads!A606","v":"Carichi da manuale di installazione (EN795)"}]
[]
[{"$nulls":5},{"$f":"+Trads!A607","v":"Interasse"},null,{"$f":"+Trads!A608","v":"Flessione massima Cavo"},null,{"$f":"+Trads!A609","v":"Fmax"},null,{"$f":"PROPER(+Trads!A605)","v":"Numero Max Di Utenti"},{"$nulls":26},"Angolo Sbagliato 1 VERO"]
[]
[{"$nulls":5},"[m]",null,"[m]",null,"[kN]",{"$nulls":28},{"$f":"+COUNTIF(AM34:AM96,TRUE)","v":0}]
[null,null,{"$f":"+Trads!A607&\" \"&\"Max\"","v":"Interasse Max"},null,null,{"$f":"_xlfn.IFNA(VLOOKUP($F$9,DB_Supporti,SupGen!S11,FALSE),\"\")","v":""},null,{"$f":"_xlfn.IFNA(VLOOKUP($F$9,DB_Supporti,SupGen!X11,FALSE),\"\")","v":""},null,{"$f":"_xlfn.IFNA(VLOOKUP($F$9,DB_Supporti,SupGen!V11,FALSE),\"\")","v":""},null,{"$f":"_xlfn.IFNA(+VLOOKUP($F$9,DB_Supporti,SupGen!Q11,FALSE),\"\")","v":""}]
[]
[null,null,{"$f":"+Trads!A607&\" \"&\"Min\"","v":"Interasse Min"},null,null,{"$f":"_xlfn.IFNA(VLOOKUP($F$9,DB_Supporti,8,FALSE),\"\")","v":""},null,{"$f":"_xlfn.IFNA(VLOOKUP($F$9,DB_Supporti,SupGen!AB11,FALSE),\"\")","v":""},null,{"$f":"_xlfn.IFNA(+VLOOKUP($F$9,DB_Supporti,SupGen!Z11,FALSE),\"\")","v":""},null,{"$f":"_xlfn.IFNA(+VLOOKUP($F$9,DB_Supporti,SupGen!Q11,FALSE),\"\")","v":""}]
[]
[]
[]
[{"$nulls":28},0]
[{"$nulls":28},0,null,null,0]
[{"$nulls":28},1]
[null,null,{"$f":"+Trads!$A$337","v":"Da Supporto #"},{"$f":"+Trads!$A$339","v":"Direzione"},null,{"$f":"+Trads!$A$338","v":"A Supporto #"},{"$f":"+Trads!$A$341","v":"Angolo°"},null,{"$f":"+Trads!$A$340","v":"Lunghezza"},null,{"$f":"PROPER(Trads!$A$342)","v":"Lunghezza Misurata"},{"$f":"PROPER(Trads!A67)","v":"Interasse Intermedi"},{"$nulls":6},{"$f":"+IF(D178=FALSE,Trads!A632,\"\")","v":"Termine la linea vita con Fine o Loop"},{"$nulls":9},1,{"$nulls":6},"Delta l",{"$f":"(AH33*1000*Y31*1000)/(Y32*#REF!)","v":{"$error":"#REF!"}},null,null,{"$f":"+F191","v":0},"int"]
[{"$nulls":28},1,{"$nulls":4},"deeflection",null,"Delta def",{"$f":"AK33*SIN(RADIANS(AH35))","v":{"$error":"#REF!"}},{"$f":"+IF(D192=Loop,AM34-$AN$33,\"\")","v":""},{"$f":"IF(M191=\"\",\"\",IF(OR(M191<90,M191>270),TRUE,M191))","v":""},{"$f":"+F192","v":0},{"$f":"+T191","v":0},null,{"$f":"TRANSPOSE(First_seg)","v":"← (180°)"},"↑ (90°)","→ (0°)","↓ (270°)","Angolo"]
[null,null,{"$f":"+_xlfn.IFS(D34=start,1,D34=ShareStart,\"X\",D34=\"\",\"\")","v":""},null,null,{"$f":"+IF(D35=\"\",\"\",IF(C35=\"X\",1,C35+1))","v":""},{"$nulls":4},{"$f":"IF(G191=0,\"\",G191)","v":""},{"$f":"IF(+U191=0,\"\",U191)","v":""},{"$nulls":15},{"$f":"IF(F35=\"\",\"\",+_xlfn.CONCAT(C35,\"-\",F35))","v":""},1,{"$nulls":4},{"$f":"IF((IF(ProjSpan=MaxSpan,MaxDef,IF(ProjSpan=MinSpan,MinDef,_xlfn.FORECAST.LINEAR(ProjSpan,DefDB,SpanDB)+IF(AND(ProjSpan>MinSpan,ProjSpan<MaxSpan),0.1,0))))>MaxDef,MaxDef,IF(ProjSpan=MaxSpan,MaxDef,IF(ProjSpan=MinSpan,MinDef,_xlfn.FORECAST.LINEAR(ProjSpan,DefDB,SpanDB)+IF(AND(ProjSpan>MinSpan,ProjSpan<MaxSpan),0.1,0))))","v":""},{"$nulls":3},{"$f":"+IF(D193=Loop,ABS(M192-$AN$33-180),\"\")","v":""},{"$f":"IF(M192=\"\",\"\",IF(OR(M192<90,M192>270),TRUE,M192))","v":""},0,0,null,{"$f":"IF(AM33=TRUE,\"\",TRANSPOSE(_xlfn.IFS(D35=\"\",\"\",AND(OR(D35=End,D35=Loop)),Partenza,D35=up,Angolosu,D35=down,Angolodw,D35=sx,Angolosx,D35=Dx,Angolodx,D35=Angle,Direzioni)))","v":""}]
[null,null,{"$f":"IF(OR(C35<>\"\",C35<>End),IF(I35=\"\",\"\",+F35),\"\")","v":""},null,null,{"$f":"IF(OR(D36=start,D36=ShareStart),\"\",IF(D36=End,\"\",IF(D36=Loop,$C$35,IF(D36<>\"\",C36+1,\"\"))))","v":""},{"$nulls":4},"",{"$f":"IF(+U192=0,\"\",U192)","v":""},{"$nulls":15},"",1,{"$nulls":8},"","",0,0,null,{"$f":"IF(AM34=TRUE,\"\",TRANSPOSE(_xlfn.IFS(D36=\"\",\"\",AND(OR(D36=End,D36=Loop)),Partenza,D36=up,Angolosu,D36=down,Angolodw,D36=sx,Angolosx,D36=Dx,Angolodx,D36=Angle,Direzioni)))","v":""}]
[null,null,{"$f":"IF(D36=start,MAX(F35,C35)+1,IF(D36=ShareStart,B192,IF(OR(C36<>\"\",C36<>End),IF(I36=\"\",\"\",+F36),\"\")))","v":""},null,null,"",{"$nulls":4},"",{"$f":"IF(+U193=0,\"\",U193)","v":""},{"$nulls":15},"",1,{"$nulls":8},"","",0,0,null,{"$f":"IF(AM35=TRUE,\"\",TRANSPOSE(_xlfn.IFS(D37=\"\",\"\",AND(OR(D37=End,D37=Loop)),Partenza,D37=up,Angolosu,D37=down,Angolodw,D37=sx,Angolosx,D37=Dx,Angolodx,D37=Angle,Direzioni)))","v":""}]
[null,null,"",null,null,"",{"$nulls":4},"","",{"$nulls":15},"",1,{"$nulls":4},"Span","Def","Fx",null,"",{"$f":"IF(M195=\"\",\"\",IF(OR(M195<90,M195>270),TRUE,M195))","v":""},0,0,null,{"$f":"IF(AM36=TRUE,\"\",TRANSPOSE(_xlfn.IFS(D38=\"\",\"\",AND(OR(D38=End,D38=Loop)),Partenza,D38=up,Angolosu,D38=down,Angolodw,D38=sx,Angolosx,D38=Dx,Angolodx,D38=Angle,Direzioni)))","v":""}]
[null,null,"",null,null,"",{"$nulls":4},"","",{"$nulls":15},"",1,{"$nulls":4},{"$f":"+F24","v":""},{"$f":"+H24","v":""},{"$f":"+J24","v":""},null,"","",0,0,null,{"$f":"IF(AM37=TRUE,\"\",TRANSPOSE(_xlfn.IFS(D39=\"\",\"\",AND(OR(D39=End,D39=Loop)),Partenza,D39=up,Angolosu,D39=down,Angolodw,D39=sx,Angolosx,D39=Dx,Angolodx,D39=Angle,Direzioni)))","v":""}]
[null,null,"",null,null,"",{"$nulls":4},"",{"$f":"IF(+U196=0,\"\",U196)","v":""},{"$nulls":15},"",1,{"$nulls":4},{"$f":"+F26","v":""},{"$f":"+H26","v":""},{"$f":"+J26","v":""},null,"","",0,0,null,{"$f":"IF(AM38=TRUE,\"\",TRANSPOSE(_xlfn.IFS(D40=\"\",\"\",AND(OR(D40=End,D40=Loop)),Partenza,D40=up,Angolosu,D40=down,Angolodw,D40=sx,Angolosx,D40=Dx,Angolodx,D40=Angle,Direzioni)))","v":""}]
[null,null,"",null,null,"",{"$nulls":4},"","",{"$nulls":15},"",{"$f":"+IF(L39=\"\",0,1)","v":0},{"$nulls":4},"Tata",{"$nulls":3},"","",0,0,null,{"$f":"IF(AM39=TRUE,\"\",TRANSPOSE(_xlfn.IFS(D41=\"\",\"\",AND(OR(D41=End,D41=Loop)),Partenza,D41=up,Angolosu,D41=down,Angolodw,D41=sx,Angolosx,D41=Dx,Angolodx,D41=Angle,Direzioni)))","v":""}]
[null,null,"",null,null,"",{"$nulls":4},"","",{"$nulls":15},"",0,{"$nulls":4},{"$f":"DEGREES(ATAN((2*DefProjBase)/ProjSpan))","v":{"$error":"#VALUE!"}},{"$nulls":3},"","",0,0,null,{"$f":"IF(AM40=TRUE,\"\",TRANSPOSE(_xlfn.IFS(D42=\"\",\"\",AND(OR(D42=End,D42=Loop)),Partenza,D42=up,Angolosu,D42=down,Angolodw,D42=sx,Angolosx,D42=Dx,Angolodx,D42=Angle,Direzioni)))","v":""}]
[null,null,"",null,null,"",{"$nulls":4},"","",{"$nulls":15},"",0,{"$nulls":8},"","",0,0,null,{"$f":"IF(AM41=TRUE,\"\",TRANSPOSE(_xlfn.IFS(D43=\"\",\"\",AND(OR(D43=End,D43=Loop)),Partenza,D43=up,Angolosu,D43=down,Angolodw,D43=sx,Angolosx,D43=Dx,Angolodx,D43=Angle,Direzioni)))","v":""}]
["10,30:30,10",null,"",null,null,"",{"$nulls":4},"","",{"$nulls":15},"",0,{"$nulls":4},"fy",{"$f":"#REF!*SIN(RADIANS(AI43))","v":{"$error":"#REF!"}},null,null,"","",0,0,null,{"$f":"IF(AM42=TRUE,\"\",TRANSPOSE(_xlfn.IFS(D44=\"\",\"\",AND(OR(D44=End,D44=Loop)),Partenza,D44=up,Angolosu,D44=down,Angolodw,D44=sx,Angolosx,D44=Dx,Angolodx,D44=Angle,Direzioni)))","v":""}]
[null,null,"",null,null,"",{"$nulls":4},"","",{"$nulls":15},"",0,{"$nulls":4},"fx",{"$f":"#REF!*COS(RADIANS(AI43))","v":{"$error":"#REF!"}},null,null,"","",0,0,null,{"$f":"IF(AM43=TRUE,\"\",TRANSPOSE(_xlfn.IFS(D45=\"\",\"\",AND(OR(D45=End,D45=Loop)),Partenza,D45=up,Angolosu,D45=down,Angolodw,D45=sx,Angolosx,D45=Dx,Angolodx,D45=Angle,Direzioni)))","v":""}]
[null,null,"",null,null,"",{"$nulls":4},"","",{"$nulls":12},{"$f":"IF(AM45=\"\",\"\",AM45>=90)","v":""},null,null,"",0,{"$nulls":8},"","",0,0,null,{"$f":"IF(AM44=TRUE,\"\",TRANSPOSE(_xlfn.IFS(D46=\"\",\"\",AND(OR(D46=End,D46=Loop)),Partenza,D46=up,Angolosu,D46=down,Angolodw,D46=sx,Angolosx,D46=Dx,Angolodx,D46=Angle,Direzioni)))","v":""}]
[null,null,"",null,null,"",{"$nulls":4},"","",{"$nulls":12},"",null,null,"",0,{"$nulls":8},"","",0,0,null,{"$f":"IF(AM45=TRUE,\"\",TRANSPOSE(_xlfn.IFS(D47=\"\",\"\",AND(OR(D47=End,D47=Loop)),Partenza,D47=up,Angolosu,D47=down,Angolodw,D47=sx,Angolosx,D47=Dx,Angolodx,D47=Angle,Direzioni)))","v":""}]
[null,null,"",null,null,"",{"$nulls":4},"","",{"$nulls":15},"",0,{"$nulls":8},"","",0,0,null,{"$f":"IF(AM46=TRUE,\"\",TRANSPOSE(_xlfn.IFS(D48=\"\",\"\",AND(OR(D48=End,D48=Loop)),Partenza,D48=up,Angolosu,D48=down,Angolodw,D48=sx,Angolosx,D48=Dx,Angolodx,D48=Angle,Direzioni)))","v":""}]
[null,null,"",null,null,"",{"$nulls":4},"","",{"$nulls":12},"",null,null,"",0,{"$nulls":4},"AyMaxWall",{"$f":"+SupTabella!K67","v":{"v":40,"d":"40.00"}},null,null,"","",0,0,null,{"$f":"IF(AM47=TRUE,\"\",TRANSPOSE(_xlfn.IFS(D49=\"\",\"\",AND(OR(D49=End,D49=Loop)),Partenza,D49=up,Angolosu,D49=down,Angolodw,D49=sx,Angolosx,D49=Dx,Angolodx,D49=Angle,Direzioni)))","v":""}]
[null,null,"",null,null,"",{"$nulls":4},"","",{"$nulls":12},"",null,null,"",0,{"$nulls":8},"","",0,0,null,{"$f":"IF(AM48=TRUE,\"\",TRANSPOSE(_xlfn.IFS(D50=\"\",\"\",AND(OR(D50=End,D50=Loop)),Partenza,D50=up,Angolosu,D50=down,Angolodw,D50=sx,Angolosx,D50=Dx,Angolodx,D50=Angle,Direzioni)))","v":""}]
[null,null,"",null,null,"",{"$nulls":4},"","",{"$nulls":12},"",null,null,"",0,{"$nulls":8},"","",0,0,null,{"$f":"IF(AM49=TRUE,\"\",TRANSPOSE(_xlfn.IFS(D51=\"\",\"\",AND(OR(D51=End,D51=Loop)),Partenza,D51=up,Angolosu,D51=down,Angolodw,D51=sx,Angolosx,D51=Dx,Angolodx,D51=Angle,Direzioni)))","v":""}]
[null,null,"",null,null,"",{"$nulls":4},"","",{"$nulls":12},"",null,null,"",0,{"$nulls":8},"","",0,0,null,{"$f":"IF(AM50=TRUE,\"\",TRANSPOSE(_xlfn.IFS(D52=\"\",\"\",AND(OR(D52=End,D52=Loop)),Partenza,D52=up,Angolosu,D52=down,Angolodw,D52=sx,Angolosx,D52=Dx,Angolodx,D52=Angle,Direzioni)))","v":""}]
[null,null,"",null,null,"",{"$nulls":4},"","",{"$nulls":12},"",null,null,"",0,{"$nulls":8},"","",0,0,null,{"$f":"IF(AM51=TRUE,\"\",TRANSPOSE(_xlfn.IFS(D53=\"\",\"\",AND(OR(D53=End,D53=Loop)),Partenza,D53=up,Angolosu,D53=down,Angolodw,D53=sx,Angolosx,D53=Dx,Angolodx,D53=Angle,Direzioni)))","v":""}]
[null,null,"",null,null,"",{"$nulls":4},"","",{"$nulls":12},"",null,null,"",0,{"$nulls":8},"","",0,0,null,{"$f":"IF(AM52=TRUE,\"\",TRANSPOSE(_xlfn.IFS(D54=\"\",\"\",AND(OR(D54=End,D54=Loop)),Partenza,D54=up,Angolosu,D54=down,Angolodw,D54=sx,Angolosx,D54=Dx,Angolodx,D54=Angle,Direzioni)))","v":""}]
[null,null,"",null,null,"",{"$nulls":4},"","",{"$nulls":12},"",null,null,"",0,{"$nulls":8},"","",0,0,null,{"$f":"IF(AM53=TRUE,\"\",TRANSPOSE(_xlfn.IFS(D55=\"\",\"\",AND(OR(D55=End,D55=Loop)),Partenza,D55=up,Angolosu,D55=down,Angolodw,D55=sx,Angolosx,D55=Dx,Angolodx,D55=Angle,Direzioni)))","v":""}]
[null,null,"",null,null,"",{"$nulls":4},"","",{"$nulls":12},"",null,null,"",0,{"$nulls":4},"AyMinWall",{"$f":"+SupTabella!K74","v":{"v":-40,"d":"-40.00"}},null,null,"","",0,0,null,{"$f":"IF(AM54=TRUE,\"\",TRANSPOSE(_xlfn.IFS(D56=\"\",\"\",AND(OR(D56=End,D56=Loop)),Partenza,D56=up,Angolosu,D56=down,Angolodw,D56=sx,Angolosx,D56=Dx,Angolodx,D56=Angle,Direzioni)))","v":""}]
[null,null,"",null,null,"",{"$nulls":4},"","",{"$nulls":12},"",null,null,"",{"$f":"+IF(L55=\"\",0,1)","v":0},"AxMinWall",{"$f":"+SupTabella!G75","v":{"v":-40,"d":"-40.00"}},"AxMaxWall",{"$f":"+SupTabella!I75","v":{"v":40,"d":"40.00"}},{"$nulls":4},"","",0,0,null,{"$f":"IF(AM55=TRUE,\"\",TRANSPOSE(_xlfn.IFS(D57=\"\",\"\",AND(OR(D57=End,D57=Loop)),Partenza,D57=up,Angolosu,D57=down,Angolodw,D57=sx,Angolosx,D57=Dx,Angolodx,D57=Angle,Direzioni)))","v":""}]
[null,null,"",null,null,"",{"$nulls":4},"","",{"$nulls":12},"",null,null,"",0,{"$nulls":8},"","",0,0,null,{"$f":"IF(AM56=TRUE,\"\",TRANSPOSE(_xlfn.IFS(D58=\"\",\"\",AND(OR(D58=End,D58=Loop)),Partenza,D58=up,Angolosu,D58=down,Angolodw,D58=sx,Angolosx,D58=Dx,Angolodx,D58=Angle,Direzioni)))","v":""}]
[null,null,"",null,null,"",{"$nulls":4},"","",{"$nulls":12},"",null,null,"",0,{"$nulls":8},"","",0,0,null,{"$f":"IF(AM57=TRUE,\"\",TRANSPOSE(_xlfn.IFS(D59=\"\",\"\",AND(OR(D59=End,D59=Loop)),Partenza,D59=up,Angolosu,D59=down,Angolodw,D59=sx,Angolosx,D59=Dx,Angolodx,D59=Angle,Direzioni)))","v":""}]
[null,null,"",null,null,"",{"$nulls":4},"","",{"$nulls":12},"",null,null,"",0,{"$nulls":8},"","",0,0,null,{"$f":"IF(AM58=TRUE,\"\",TRANSPOSE(_xlfn.IFS(D60=\"\",\"\",AND(OR(D60=End,D60=Loop)),Partenza,D60=up,Angolosu,D60=down,Angolodw,D60=sx,Angolosx,D60=Dx,Angolodx,D60=Angle,Direzioni)))","v":""}]
[null,null,"",null,null,"",{"$nulls":4},"","",{"$nulls":12},"",null,null,"",0,{"$nulls":8},"","",0,0,null,{"$f":"IF(AM59=TRUE,\"\",TRANSPOSE(_xlfn.IFS(D61=\"\",\"\",AND(OR(D61=End,D61=Loop)),Partenza,D61=up,Angolosu,D61=down,Angolodw,D61=sx,Angolosx,D61=Dx,Angolodx,D61=Angle,Direzioni)))","v":""}]
[null,null,"",null,null,"",{"$nulls":4},"","",{"$nulls":12},"",null,null,"",0,{"$nulls":8},"","",0,0,null,{"$f":"IF(AM60=TRUE,\"\",TRANSPOSE(_xlfn.IFS(D62=\"\",\"\",AND(OR(D62=End,D62=Loop)),Partenza,D62=up,Angolosu,D62=down,Angolodw,D62=sx,Angolosx,D62=Dx,Angolodx,D62=Angle,Direzioni)))","v":""}]
[null,null,"",null,null,"",{"$nulls":4},"","",{"$nulls":12},"",null,null,"",0,{"$nulls":8},"","",0,0,null,{"$f":"IF(AM61=TRUE,\"\",TRANSPOSE(_xlfn.IFS(D63=\"\",\"\",AND(OR(D63=End,D63=Loop)),Partenza,D63=up,Angolosu,D63=down,Angolodw,D63=sx,Angolosx,D63=Dx,Angolodx,D63=Angle,Direzioni)))","v":""}]
[null,null,"",null,null,"",{"$nulls":4},"","",{"$nulls":12},"",null,null,"",0,{"$nulls":8},"","",0,0,null,{"$f":"IF(AM62=TRUE,\"\",TRANSPOSE(_xlfn.IFS(D64=\"\",\"\",AND(OR(D64=End,D64=Loop)),Partenza,D64=up,Angolosu,D64=down,Angolodw,D64=sx,Angolosx,D64=Dx,Angolodx,D64=Angle,Direzioni)))","v":""}]
[null,null,"",null,null,"",{"$nulls":4},"","",{"$nulls":12},"",null,null,"",0,{"$nulls":8},"","",{"$f":"+F223","v":0},0,null,{"$f":"IF(AM63=TRUE,\"\",TRANSPOSE(_xlfn.IFS(D65=\"\",\"\",AND(OR(D65=End,D65=Loop)),Partenza,D65=up,Angolosu,D65=down,Angolodw,D65=sx,Angolosx,D65=Dx,Angolodx,D65=Angle,Direzioni)))","v":""}]
[null,null,"",null,null,"",{"$nulls":4},"","",{"$nulls":12},"",null,null,"",0,{"$nulls":8},"","",0,{"$f":"+T223","v":0},null,{"$f":"IF(AM64=TRUE,\"\",TRANSPOSE(_xlfn.IFS(D66=\"\",\"\",AND(OR(D66=End,D66=Loop)),Partenza,D66=up,Angolosu,D66=down,Angolodw,D66=sx,Angolosx,D66=Dx,Angolodx,D66=Angle,Direzioni)))","v":""}]
[null,null,"",null,null,"",{"$nulls":4},{"$f":"IF(G223=0,\"\",G223)","v":""},"",{"$nulls":12},"",null,null,{"$f":"IF(F67=\"\",\"\",+_xlfn.CONCAT(C67,\"-\",F67))","v":""},0,{"$nulls":8},{"$f":"+IF(D225=Loop,ABS(M224-$AN$33-180),\"\")","v":""},"",0,0,null,{"$f":"IF(AM65=TRUE,\"\",TRANSPOSE(_xlfn.IFS(D67=\"\",\"\",AND(OR(D67=End,D67=Loop)),Partenza,D67=up,Angolosu,D67=down,Angolodw,D67=sx,Angolosx,D67=Dx,Angolodx,D67=Angle,Direzioni)))","v":""}]
[null,null,"",null,null,{"$f":"IF(OR(D68=start,D68=ShareStart),\"\",IF(D68=End,\"\",IF(D68=Loop,$C$35,IF(D68<>\"\",C68+1,\"\"))))","v":""},{"$nulls":4},"","",{"$nulls":12},"",null,null,"",0,{"$nulls":8},"","",0,0,null,{"$f":"IF(AM66=TRUE,\"\",TRANSPOSE(_xlfn.IFS(D68=\"\",\"\",AND(OR(D68=End,D68=Loop)),Partenza,D68=up,Angolosu,D68=down,Angolodw,D68=sx,Angolosx,D68=Dx,Angolodx,D68=Angle,Direzioni)))","v":""}]
[null,null,{"$f":"IF(D68=start,MAX(F67,C67)+1,IF(D68=ShareStart,B224,IF(OR(C68<>\"\",C68<>End),IF(I68=\"\",\"\",+F68),\"\")))","v":""},null,null,"",{"$nulls":4},"","",{"$nulls":12},"",null,null,"",0,{"$nulls":8},"","",0,0,null,{"$f":"IF(AM67=TRUE,\"\",TRANSPOSE(_xlfn.IFS(D69=\"\",\"\",AND(OR(D69=End,D69=Loop)),Partenza,D69=up,Angolosu,D69=down,Angolodw,D69=sx,Angolosx,D69=Dx,Angolodx,D69=Angle,Direzioni)))","v":""}]
[null,null,"",null,null,"",{"$nulls":4},"","",{"$nulls":12},"",null,null,"",0,{"$nulls":8},"","",0,0,null,{"$f":"IF(AM68=TRUE,\"\",TRANSPOSE(_xlfn.IFS(D70=\"\",\"\",AND(OR(D70=End,D70=Loop)),Partenza,D70=up,Angolosu,D70=down,Angolodw,D70=sx,Angolosx,D70=Dx,Angolodx,D70=Angle,Direzioni)))","v":""}]
[null,null,"",null,null,"",{"$nulls":4},"","",{"$nulls":12},"",null,null,"",0,{"$nulls":8},"","",0,0,null,{"$f":"IF(AM69=TRUE,\"\",TRANSPOSE(_xlfn.IFS(D71=\"\",\"\",AND(OR(D71=End,D71=Loop)),Partenza,D71=up,Angolosu,D71=down,Angolodw,D71=sx,Angolosx,D71=Dx,Angolodx,D71=Angle,Direzioni)))","v":""}]
[null,null,"",null,null,"",{"$nulls":4},"","",{"$nulls":12},{"$f":"IF(AM71=\"\",\"\",AM71>=90)","v":""},null,null,"",0,{"$nulls":8},"","",0,0,null,{"$f":"IF(AM70=TRUE,\"\",TRANSPOSE(_xlfn.IFS(D72=\"\",\"\",AND(OR(D72=End,D72=Loop)),Partenza,D72=up,Angolosu,D72=down,Angolodw,D72=sx,Angolosx,D72=Dx,Angolodx,D72=Angle,Direzioni)))","v":""}]
[null,null,"",null,null,"",{"$nulls":4},"","",{"$nulls":12},"",null,null,"",0,{"$nulls":8},"","",0,0,null,{"$f":"IF(AM71=TRUE,\"\",TRANSPOSE(_xlfn.IFS(D73=\"\",\"\",AND(OR(D73=End,D73=Loop)),Partenza,D73=up,Angolosu,D73=down,Angolodw,D73=sx,Angolosx,D73=Dx,Angolodx,D73=Angle,Direzioni)))","v":""}]
[null,null,"",null,null,"",{"$nulls":4},"","",{"$nulls":12},"",null,null,"",0,{"$nulls":8},"","",0,0,null,{"$f":"IF(AM72=TRUE,\"\",TRANSPOSE(_xlfn.IFS(D74=\"\",\"\",AND(OR(D74=End,D74=Loop)),Partenza,D74=up,Angolosu,D74=down,Angolodw,D74=sx,Angolosx,D74=Dx,Angolodx,D74=Angle,Direzioni)))","v":""}]
[null,null,"",null,null,"",{"$nulls":4},"","",{"$nulls":12},"",null,null,"",0,{"$nulls":8},"","",0,0,null,{"$f":"IF(AM73=TRUE,\"\",TRANSPOSE(_xlfn.IFS(D75=\"\",\"\",AND(OR(D75=End,D75=Loop)),Partenza,D75=up,Angolosu,D75=down,Angolodw,D75=sx,Angolosx,D75=Dx,Angolodx,D75=Angle,Direzioni)))","v":""}]
[null,null,"",null,null,"",{"$nulls":4},"","",{"$nulls":12},"",null,null,"",0,{"$nulls":8},"","",0,0,null,{"$f":"IF(AM74=TRUE,\"\",TRANSPOSE(_xlfn.IFS(D76=\"\",\"\",AND(OR(D76=End,D76=Loop)),Partenza,D76=up,Angolosu,D76=down,Angolodw,D76=sx,Angolosx,D76=Dx,Angolodx,D76=Angle,Direzioni)))","v":""}]
[null,null,"",null,null,"",{"$nulls":4},"","",{"$nulls":12},"",null,null,"",0,{"$nulls":8},"","",0,0,null,{"$f":"IF(AM75=TRUE,\"\",TRANSPOSE(_xlfn.IFS(D77=\"\",\"\",AND(OR(D77=End,D77=Loop)),Partenza,D77=up,Angolosu,D77=down,Angolodw,D77=sx,Angolosx,D77=Dx,Angolodx,D77=Angle,Direzioni)))","v":""}]
[null,null,"",null,null,"",{"$nulls":4},"","",{"$nulls":12},"",null,null,"",0,{"$nulls":8},"","",0,0,null,{"$f":"IF(AM76=TRUE,\"\",TRANSPOSE(_xlfn.IFS(D78=\"\",\"\",AND(OR(D78=End,D78=Loop)),Partenza,D78=up,Angolosu,D78=down,Angolodw,D78=sx,Angolosx,D78=Dx,Angolodx,D78=Angle,Direzioni)))","v":""}]
[null,null,"",null,null,"",{"$nulls":4},"","",{"$nulls":12},"",null,null,"",0,{"$nulls":8},"","",0,0,null,{"$f":"IF(AM77=TRUE,\"\",TRANSPOSE(_xlfn.IFS(D79=\"\",\"\",AND(OR(D79=End,D79=Loop)),Partenza,D79=up,Angolosu,D79=down,Angolodw,D79=sx,Angolosx,D79=Dx,Angolodx,D79=Angle,Direzioni)))","v":""}]
[null,null,"",null,null,"",{"$nulls":4},"","",{"$nulls":12},"",null,null,"",0,{"$nulls":8},"","",0,0,null,{"$f":"IF(AM78=TRUE,\"\",TRANSPOSE(_xlfn.IFS(D80=\"\",\"\",AND(OR(D80=End,D80=Loop)),Partenza,D80=up,Angolosu,D80=down,Angolodw,D80=sx,Angolosx,D80=Dx,Angolodx,D80=Angle,Direzioni)))","v":""}]
[null,null,"",null,null,"",{"$nulls":4},"","",{"$nulls":12},"",null,null,"",0,{"$nulls":8},"","",0,0,null,{"$f":"IF(AM79=TRUE,\"\",TRANSPOSE(_xlfn.IFS(D81=\"\",\"\",AND(OR(D81=End,D81=Loop)),Partenza,D81=up,Angolosu,D81=down,Angolodw,D81=sx,Angolosx,D81=Dx,Angolodx,D81=Angle,Direzioni)))","v":""}]
[null,null,"",null,null,"",{"$nulls":4},"","",{"$nulls":12},"",null,null,"",0,{"$nulls":8},"","",0,0,null,{"$f":"IF(AM80=TRUE,\"\",TRANSPOSE(_xlfn.IFS(D82=\"\",\"\",AND(OR(D82=End,D82=Loop)),Partenza,D82=up,Angolosu,D82=down,Angolodw,D82=sx,Angolosx,D82=Dx,Angolodx,D82=Angle,Direzioni)))","v":""}]
[null,null,"",null,null,"",{"$nulls":4},"","",{"$nulls":12},"",null,null,"",0,{"$nulls":8},"","",0,0,null,{"$f":"IF(AM81=TRUE,\"\",TRANSPOSE(_xlfn.IFS(D83=\"\",\"\",AND(OR(D83=End,D83=Loop)),Partenza,D83=up,Angolosu,D83=down,Angolodw,D83=sx,Angolosx,D83=Dx,Angolodx,D83=Angle,Direzioni)))","v":""}]
[null,null,"",null,null,"",{"$nulls":4},"","",{"$nulls":12},"",null,null,"",0,{"$nulls":8},"","",0,0,null,{"$f":"IF(AM82=TRUE,\"\",TRANSPOSE(_xlfn.IFS(D84=\"\",\"\",AND(OR(D84=End,D84=Loop)),Partenza,D84=up,Angolosu,D84=down,Angolodw,D84=sx,Angolosx,D84=Dx,Angolodx,D84=Angle,Direzioni)))","v":""}]
[null,null,"",null,null,"",{"$nulls":4},"","",{"$nulls":12},"",null,null,"",0,{"$nulls":8},"","",0,0,null,{"$f":"IF(AM83=TRUE,\"\",TRANSPOSE(_xlfn.IFS(D85=\"\",\"\",AND(OR(D85=End,D85=Loop)),Partenza,D85=up,Angolosu,D85=down,Angolodw,D85=sx,Angolosx,D85=Dx,Angolodx,D85=Angle,Direzioni)))","v":""}]
[null,null,"",null,null,"",{"$nulls":4},"","",{"$nulls":12},"",null,null,"",0,{"$nulls":8},"","",0,0,null,{"$f":"IF(AM84=TRUE,\"\",TRANSPOSE(_xlfn.IFS(D86=\"\",\"\",AND(OR(D86=End,D86=Loop)),Partenza,D86=up,Angolosu,D86=down,Angolodw,D86=sx,Angolosx,D86=Dx,Angolodx,D86=Angle,Direzioni)))","v":""}]
[null,null,"",null,null,"",{"$nulls":4},"","",{"$nulls":12},"",null,null,"",0,{"$nulls":4},"apri",{"$nulls":3},"","",0,0,null,{"$f":"IF(AM85=TRUE,\"\",TRANSPOSE(_xlfn.IFS(D87=\"\",\"\",AND(OR(D87=End,D87=Loop)),Partenza,D87=up,Angolosu,D87=down,Angolodw,D87=sx,Angolosx,D87=Dx,Angolodx,D87=Angle,Direzioni)))","v":""}]
[null,null,"",null,null,"",{"$nulls":4},"","",{"$nulls":12},"",null,null,"",0,{"$nulls":8},"","",0,0,null,{"$f":"IF(AM86=TRUE,\"\",TRANSPOSE(_xlfn.IFS(D88=\"\",\"\",AND(OR(D88=End,D88=Loop)),Partenza,D88=up,Angolosu,D88=down,Angolodw,D88=sx,Angolosx,D88=Dx,Angolodx,D88=Angle,Direzioni)))","v":""}]
[null,null,"",null,null,"",{"$nulls":4},"","",{"$nulls":12},"",null,null,"",0,{"$nulls":8},"","",0,0,null,{"$f":"IF(AM87=TRUE,\"\",TRANSPOSE(_xlfn.IFS(D89=\"\",\"\",AND(OR(D89=End,D89=Loop)),Partenza,D89=up,Angolosu,D89=down,Angolodw,D89=sx,Angolosx,D89=Dx,Angolodx,D89=Angle,Direzioni)))","v":""}]
[null,null,"",null,null,"",{"$nulls":4},"","",{"$nulls":12},"",null,null,"",0,{"$nulls":8},"","",0,0,null,{"$f":"IF(AM88=TRUE,\"\",TRANSPOSE(_xlfn.IFS(D90=\"\",\"\",AND(OR(D90=End,D90=Loop)),Partenza,D90=up,Angolosu,D90=down,Angolodw,D90=sx,Angolosx,D90=Dx,Angolodx,D90=Angle,Direzioni)))","v":""}]
[null,null,"",null,null,"",{"$nulls":4},"","",{"$nulls":12},"",null,null,"",0,{"$nulls":8},"","",0,0,null,{"$f":"IF(AM89=TRUE,\"\",TRANSPOSE(_xlfn.IFS(D91=\"\",\"\",AND(OR(D91=End,D91=Loop)),Partenza,D91=up,Angolosu,D91=down,Angolodw,D91=sx,Angolosx,D91=Dx,Angolodx,D91=Angle,Direzioni)))","v":""}]
[null,null,"",null,null,"",{"$nulls":4},"","",{"$nulls":12},"",null,null,"",0,{"$nulls":8},"","",0,0,null,{"$f":"IF(AM90=TRUE,\"\",TRANSPOSE(_xlfn.IFS(D92=\"\",\"\",AND(OR(D92=End,D92=Loop)),Partenza,D92=up,Angolosu,D92=down,Angolodw,D92=sx,Angolosx,D92=Dx,Angolodx,D92=Angle,Direzioni)))","v":""}]
[null,null,"",null,null,"",{"$nulls":4},"","",{"$nulls":12},"",null,null,"",0,{"$nulls":8},"","",0,0,null,{"$f":"IF(AM91=TRUE,\"\",TRANSPOSE(_xlfn.IFS(D93=\"\",\"\",AND(OR(D93=End,D93=Loop)),Partenza,D93=up,Angolosu,D93=down,Angolodw,D93=sx,Angolosx,D93=Dx,Angolodx,D93=Angle,Direzioni)))","v":""}]
[null,null,"",null,null,"",{"$nulls":4},"","",{"$nulls":12},"",null,null,"",0,{"$nulls":8},"","",0,0,null,{"$f":"IF(AM92=TRUE,\"\",TRANSPOSE(_xlfn.IFS(D94=\"\",\"\",AND(OR(D94=End,D94=Loop)),Partenza,D94=up,Angolosu,D94=down,Angolodw,D94=sx,Angolosx,D94=Dx,Angolodx,D94=Angle,Direzioni)))","v":""}]
[null,null,"",null,null,"",{"$nulls":4},"","",{"$nulls":12},"",null,null,"",0,{"$nulls":8},"","",0,0,null,{"$f":"IF(AM93=TRUE,\"\",TRANSPOSE(_xlfn.IFS(D95=\"\",\"\",AND(OR(D95=End,D95=Loop)),Partenza,D95=up,Angolosu,D95=down,Angolodw,D95=sx,Angolosx,D95=Dx,Angolodx,D95=Angle,Direzioni)))","v":""}]
[null,null,"",null,null,"",{"$nulls":4},"","",{"$nulls":12},"",null,null,"",0,{"$nulls":8},"","",0,null,null,{"$f":"IF(AM94=TRUE,\"\",TRANSPOSE(_xlfn.IFS(D96=\"\",\"\",AND(OR(D96=End,D96=Loop)),Partenza,D96=up,Angolosu,D96=down,Angolodw,D96=sx,Angolos9,D96=Dx,Angolodx,D96=Angle,Direzioni)))","v":""}]
[null,null,"",null,null,"",{"$nulls":4},"","",{"$nulls":12},"",null,null,"",0,{"$nulls":8},""]
[{"$nulls":28},0]
[{"$nulls":31},0]
[]
[{"$nulls":28},1]
[null,null,{"$f":"+Trads!$A$340&\" \"&Trads!$A$79","v":"Lunghezza Totale"},null,null,{"$f":"ROUND(SUBTOTAL(9,I35:J61,K35:K61),2)","v":{"v":0,"d":"0.00"}},{"$nulls":22},1]
[{"$nulls":28},1]
[null,null,{"$f":"+Trads!A610&\" [m]\"","v":"Lunghezza massima campata [m]"},null,null,{"$f":"IF(D178=FALSE,\"\",MAX(L35:M88))","v":""},{"$nulls":22},1]
[]
[null,null,{"$f":"+Trads!A611","v":"Carico applicato alla campata all'interno di questo segmento"},{"$nulls":4},{"$f":"_xlfn.IFNA(+_xlfn.XLOOKUP(F104,L35:L97,AB35:AB97),\"\")","v":""}]
[]
[null,null,{"$f":"+Trads!A612","v":"Reazione sugli elementi di ancoraggio della fune a più campate"}]
[null,null,"Element",null,{"$f":"+Trads!A348","v":"Terminali"},null,null,{"$f":"PROPER(Trads!$A$11)","v":"Intermedio"},null,null,{"$f":"+Trads!$A$613","v":"Curva"}]
[{"$nulls":4},"F1 [kN]","F2 [kN]",{"$f":"+Trads!$A$618&\" [kN]\"","v":"Modulo [kN]"},"F1 [kN]","F2 [kN]",{"$f":"+Trads!$A$618&\" [kN]\"","v":"Modulo [kN]"},"F1 [kN]","F2 [kN]",{"$f":"+Trads!$A$618&\" [kN]\"","v":"Modulo [kN]"}]
[null,null,{"$f":"+Trads!A629","v":"ancoraggi alla campata caricata"},null,{"$f":"+IF(D178=FALSE,\"\",IFERROR(SupLL!P107,0))","v":""},{"$f":"IF(D178=FALSE,\"\",IFERROR(SupLL!P106,0))","v":""},{"$f":"+IF(D178=FALSE,\"\",IFERROR(_xlfn.FORECAST.LINEAR(ProjSpan,FxDb,SpanDB),0))","v":""},{"$f":"IF(D178=FALSE,\"\",IFERROR(SupLL!P107,0))","v":""},{"$f":"IF(D178=FALSE,\"\",IFERROR(SupLL!P106,0))","v":""},{"$f":"IF(D178=FALSE,\"\",IFERROR(_xlfn.FORECAST.LINEAR(ProjSpan,FxDb,SpanDB),0))","v":""},{"$f":"IF(D178=FALSE,\"\",IFERROR(VLOOKUP(M111,AA191:AC253,2,FALSE),0))","v":""},{"$f":"IF(D178=FALSE,\"\",IFERROR(VLOOKUP(M111,AA191:AC253,3,FALSE),0))","v":""},{"$f":"IF(D178=FALSE,\"\",IFERROR(AA256,0))","v":""}]
[null,null,{"$f":"+Trads!A630","v":"ancoraggi alla campata non caricata"},null,{"$f":"+IF(D178=FALSE,\"\",IFERROR(_xlfn.FORECAST.LINEAR(ProjSpan,FxDb,SpanDB),0))","v":""},{"$f":"IF(D178=FALSE,\"\",0)","v":""},{"$f":"E112","v":""},{"$f":"+IF(D178=FALSE,\"\",0)","v":""},{"$f":"IF(D178=FALSE,\"\",0)","v":""},{"$f":"IF(D178=FALSE,\"\",0)","v":""},{"$nulls":32},"Larghezza",{"$f":"IF(AK123=0,\"\",+AK123)","v":""}]
[{"$nulls":42},"Testo Etichetta",{"$f":"IFERROR(+_xlfn.CONCAT(H118,\": \",_xlfn.CEILING.MATH(TRUNC(AR119,2),0.01)),\"\")","v":""}]
[null,null,{"$f":"+Trads!$A$614&\" [kN]\"","v":"Carico massimo di progetto [kN]"},null,null,{"$f":"IF(D178=FALSE,\"\",MAX(G111:G112,J111:J112,M111))","v":""},null,{"$f":"+Trads!$A$615","v":"Freccia della fune della campata rispetto ai vincoli delle estremità di giunzione"},{"$nulls":29},"Monocampata",{"$f":"+_xlfn.XLOOKUP(AH124,AB35:AB40,AO34:AO39)","v":0}]
[]
[{"$nulls":7},{"$f":"+Trads!$A$616","v":"Campata caricata"},null,null,{"$f":"IF(D178=FALSE,\"\",IFERROR(+H106,\"\"))","v":""},{"$nulls":26},{"$f":"+IF(M111=0,TRUE,FALSE)","v":false}]
[]
[{"$nulls":7},{"$f":"+Trads!A617&\" [m]\"","v":"Freccia [m]"},null,null,{"$f":"IF(D178=FALSE,\"\",IFERROR(IF(TotLung<=MaxSpan,SupLL!S99,SupLL!S99+SupLL!S104/1000),\"\"))","v":""},null,null,"*",{"$nulls":25},"Offeset",null,15,null,"Freccia"]
[{"$nulls":7},{"$f":"IF(D178=FALSE,\"\",+\"*\"&ROUND(SupLL!S103/1000,2)&Trads!A619)","v":""},{"$nulls":33},{"$f":"+ProjSpan","v":""},null,{"$f":"+K118","v":""}]
[{"$nulls":36},{"$f":"+IF(D36=End,TRUE,FALSE)","v":false},null,null,{"$f":"+G111","v":""},null,{"$f":"+IF(D178=FALSE,\"\",IF(AP119=0,0,(AP118-AP119)/2))","v":""}]
[null,null,{"$f":"+H114","v":"Freccia della fune della campata rispetto ai vincoli delle estremità di giunzione"},{"$nulls":36},{"$f":"+M111","v":""}]
[{"$nulls":36},"Max","Max/2","Etichette",{"$nulls":7},"Dimensione Tratto"]
[{"$nulls":36},{"$f":"+ProjSpan","v":""},{"$f":"+IF(D178=FALSE,\"\",+AK123/2)","v":""},"Minore","Deformata",null,"A riposo",null,"Freccia",null,null,"x","y"]
[{"$nulls":33},{"$f":"+K116","v":""},{"$nulls":3},"Angolo Più piccolo",{"$f":"_xlfn.IFNA(+_xlfn.XLOOKUP(\"MIN\",AZ126:AZ127,AM126:AM127),\"\")","v":""},"x","y","X","Y","x","y",null,{"$f":"+AN126","v":""},2]
[{"$nulls":33},{"$f":"+_xlfn.CONCAT(AH126-1,\"-\",AH126)","v":"-1-0"},{"$f":"+_xlfn.XLOOKUP($AH$124,$AB$35:$AB$97,AO33:AO95)","v":"int"},null,null,{"$f":"IF(AK119=TRUE,Trads!A630,IF(AM125=0,\"\",+IF(AM125=$AM$124,Trads!A630,\"\")))","v":""},{"$nulls":8},{"$f":"+AN128","v":""},2,null,"Angoli"]
[{"$nulls":33},{"$f":"_xlfn.NUMBERVALUE(LEFT(AH124,1))","v":0},{"$f":"+_xlfn.XLOOKUP($AH$124,$AB$35:$AB$97,AO34:AO96)","v":0},null,"Angolo",{"$f":"+IF(AI126=0,\"\",IF(AI126=1,\"\",Trads!A631))","v":""},{"$f":"+IF(D178=FALSE,\"\",IF(AL126=\"\",AH126,_xlfn.CONCAT(AL126,\" \",AH124)))","v":""},{"$f":"+IF(D178=FALSE,\"\",0+AP120)","v":""},{"$f":"+IF(D178=FALSE,\"\",0)","v":""},{"$f":"+AN126","v":""},{"$f":"+IF(D178=FALSE,\"\",0)","v":""},{"$f":"+AN127","v":""},{"$f":"+IF(D178=FALSE,\"\",0)","v":""},{"$nulls":4},{"$f":"IF(AH126=1,FALSE,VLOOKUP(AH126,CoordXY,11,FALSE))","v":0},{"$f":"+ABS(180-AX126)","v":180},{"$f":"+IF(AY126<=AY127,\"MIN\",\"\")","v":"MIN"}]
[{"$nulls":33},{"$f":"_xlfn.NUMBERVALUE(+RIGHT(AH124,1))","v":0},null,null,"Angolo",{"$f":"+IF(AI126=0,\"\",Trads!A631)","v":""},{"$f":"+IF(D178=FALSE,\"\",IF(AL127=\"\",AH127,_xlfn.CONCAT(AL127,\" \",AH124)))","v":""},{"$f":"+IF(D178=FALSE,\"\",AL123+AP120)","v":""},{"$f":"+IF(D178=FALSE,\"\",IFERROR(-AR119,0))","v":""},{"$f":"+AN128","v":""},{"$f":"+IF(D178=FALSE,\"\",0)","v":""},{"$f":"+AR126","v":""},{"$f":"+AO127","v":""},{"$nulls":4},{"$f":"+VLOOKUP(AH127,CoordXY,11,FALSE)","v":0},{"$f":"IFERROR(+ABS(180-AX127),\"\")","v":180},{"$f":"+IF(AY127<=AY126,\"MIN\",\"\")","v":"MIN"}]
[{"$nulls":33},{"$f":"+_xlfn.CONCAT(AH127,\"-\",AH127+1)","v":"0-1"},{"$f":"+_xlfn.XLOOKUP($AH$124,$AB$35:$AB$97,AO35:AO97)","v":0},null,null,{"$f":"IF(AK122=TRUE,Trads!A633,IF(AM128=0,\"\",+IF(AM128=$AM$124,Trads!A633,\"\")))","v":""},null,{"$f":"+IF(D178=FALSE,\"\",+AK123+AP120)","v":""},{"$f":"+IF(D178=FALSE,\"\",0)","v":""},{"$f":"+AP127","v":""},{"$f":"+IF(D178=FALSE,\"\",0)","v":""}]
[{"$nulls":46},"Offeset Dimension",null,null,"Ultimo"]
[{"$nulls":46},2,null,null,{"$f":"+C187","v":0}]
[{"$nulls":40},"Limite SupDx"]
[{"$nulls":38},"offset",null,"x","y",null,"Xmax","Ymax"]
[{"$nulls":33},"Sposta Sx",{"$f":"IFERROR(AN141-(IF(AL126<>\"\",80,20)),0)","v":-20},{"$f":"+IF(AL126=\"\",-20,0)","v":-20},null,null,2,null,{"$f":"+MAX(AN126:AN130,AP126:AP130)","v":0},{"$f":"MAX(AO126:AO130,AQ126:AQ130)","v":0},null,{"$f":"+MAX(AN126:AN130,AP126:AP130)","v":0},{"$f":"IF(AP133=0,12,ABS(+MIN(AO126:AO130,AQ126:AQ130)))","v":12}]
[{"$nulls":33},"Sposta Dx",{"$f":"IFERROR(AN142-(IF(AL127<>\"\",80,20)),0)","v":-20},{"$f":"+IF(AL127=\"\",-20,0)","v":-20},null,null,"Limite infSIX",null,{"$f":"+AO133+AM133","v":2},{"$f":"IF(AP133=0,15+AP133+AM133,AP133+AM133)","v":17}]
[{"$nulls":33},"TopSx",30,{"$nulls":3},"x","y",{"$nulls":4},{"$f":"+IFERROR((AS133/AR133)/3,0)","v":0},null,{"$f":"21/7","v":3}]
[{"$nulls":33},"TopDx",30,{"$nulls":3},{"$f":"+MIN(AN126:AN130,AP126:AP130)","v":0},{"$f":"+IFERROR(MIN(AO126:AO130,AQ126:AQ130)*AS135,0)","v":{"v":0,"d":"0.000"}},null,{"$f":"+ABS(AN136-AP133)","v":{"v":0,"d":"0.0000"}},"Rapporto H/L"]
[{"$nulls":38},{"$f":"+AM136-AM133","v":-2},{"$f":"+AN136-AM133","v":{"v":-2,"d":"-2.000"}},null,{"$f":"+AO134","v":2},{"$f":"IFERROR(+AP137/AP136,0)","v":{"v":0,"d":"0.000"}}]
[]
[null,null,{"$f":"+Trads!A624","v":"NOTE"}]
[null,null,{"$f":"+Trads!A622","v":"I fissaggi e gli ancoraggi devono essere gli stessi in tutti i punti di ancoraggio."}]
[null,null,{"$f":"+Trads!A623","v":"Prima della costruzione, tutti i calcoli devono essere verificati e approvati dal progettista responsabile."},{"$nulls":34},-2,0,{"$f":"IFERROR(_xlfn.FORECAST.LINEAR(AU124,$AM$141:$AM$142,$AL$141:$AL$142),0)","v":0}]
[null,null,{"$f":"+Trads!A625","v":"I valori di resistenza meccanica e la geometria si riferiscono alla certificazione del prodotto."},{"$nulls":34},17,730,{"$f":"IFERROR(+_xlfn.FORECAST.LINEAR(AU125,$AM$141:$AM$142,$AL$141:$AL$142),0)","v":0}]
[null,null,{"$f":"+Trads!A626","v":"La verifica della resistenza dei sistemi di ancoraggio deve essere realizzata a parte."}]
[null,null,{"$f":"+Trads!A627","v":"Tutti i calcoli devono essere verificati e approvati dal progettista responsabile prima dell'esecuzione. Il progettista è tenuto a verificare, ad ogni utilizzo, la conformità dei dati alle normative vigenti e al progetto. La responsabilità ultima della scelta del prodotto appropriato per una specifica applicazione spetta al progettista."}]
[null,null,{"$f":"+Trads!A628","v":"I risultati ottenuti in questa scheda sono di natura indicativa e vanno considerati come un servizio tecnico-commerciale nell'ambito dell'attività di vendita di Rotho Blaas srl. Il numero e lo spessore degli inserti devono essere determinati dal progettista responsabile che è tenuto a verificare l'esattezza dei risultati derivanti dall'elaborazione dei dati inseriti. Rotho Blaas srl non garantisce la conformità alla normativa vigente e la progettazione dei calcoli effettuati tramite questo foglio di calcolo. In particolare, in seguito alla modifica delle disposizioni pertinenti, quali ad esempio norme, approvazioni, ecc. il programma potrebbe diventare, in parte o in toto, non valido. Rotho Blaas srl non garantisce e non sarà responsabile per danni o conseguenze dirette o indirette o altro, in qualsiasi modo (garanzia per difetti, garanzia per malfunzionamento, responsabilità del prodotto o legale, ecc.) L'Utente dichiara di utilizzare il foglio di calcolo in qualità di professionista con l'obbligo e la responsabilità di verificare che il foglio di calcolo risponda alle sue specifiche esigenze."}]
{"$rows_empty":32}
[{"$nulls":3},{"$f":"+IF(OR((AM23>0),AND(D180=0,D183=0)),FALSE,TRUE)","v":false}]
[]
[{"$nulls":3},{"$f":"+COUNTIF(D191:D252,End)","v":0}]
[{"$nulls":13},"numero di accessori",{"$f":"IF(#REF!=\"\",0,+VLOOKUP(#REF!,N182:O184,2,FALSE))","v":{"$error":"#REF!"}}]
[null,null,"Totale Linee","Loop","Term",{"$nulls":8},{"$f":"+Trads!$A$348","v":"Terminali"},{"$f":"+E183*2","v":2}]
[null,null,1,{"$f":"+COUNTIF(D191:D252,Loop)","v":0},{"$f":"+C183-D183","v":1},{"$nulls":8},{"$f":"+Trads!$A$349","v":"Tutti i supporti"},{"$f":"+C187+T189+N190+P190","v":0}]
[{"$nulls":13},{"$f":"+Trads!$A$350","v":"n. supporti"},{"$nulls":4},"intermedi",{"$f":"+COUNTIF(V191:V252,\"int\")","v":0}]
[{"$nulls":12},{"$f":"IF(D192=Loop,ABS(180-ABS(L192-F191)),IF(AND(H191=H192,I191=I192),\"\",ABS(180-ABS(F192-F191))))","v":""},{"$nulls":5},"Angoli",{"$f":"+COUNTIF(V191:V252,\"ang\")-1","v":-1}]
[null,null,"Supporti Principali",{"$nulls":9},{"$f":"IF(D193=Loop,ABS(180-ABS(L193-F192)),IF(AND(H192=H193,I192=I193),\"\",ABS(180-ABS(F193-F192))))","v":""},"Angoli Totali",{"$f":"+N190+P190","v":0}]
[null,null,{"$f":"+MAX(C190:C252)","v":0},{"$nulls":4},{"$f":"+OR(D35=\"\",I35=\"\")","v":true},{"$nulls":5},"Angoli <>90°",{"$f":"+P190","v":0}]
[null,null,"Supporto",{"$nulls":10},"Angoli =90°",{"$f":"+N190","v":0},{"$nulls":3},"interasse","Somma Int",{"$nulls":4},"costruzione"]
[null,null,"Partenza",{"$nulls":3},"Misura","X","Y",{"$nulls":4},"Angoli = 90°","Angoli=INT","Angoli <> 90°",null,null,{"$f":"+F24","v":""},{"$f":"+SUM(T191:T252)+O190","v":0},{"$nulls":3},"F interpolazione","F1 da int","F2 da int","F mod","F1","F2",null,null,"X2-X1","Y2-Y1","angolo 1","Angolo"]
[null,null,{"$f":"+C35","v":""},"Direzione","Lunghezza","Angolo(°)",{"$f":"+IF(D190=Loop,SQRT((H190-H189)^2+(I190-I189)^2),0)","v":{"v":0,"d":"0.00"}},{"$f":"+IF($H$187=TRUE,0,E31)","v":{"v":0,"d":"0.00"}},{"$f":"+IF($H$187=TRUE,0,E32)","v":{"v":0,"d":"0.00"}},"Sen","Cos","Angolo Loop","Angolo",{"$f":"+COUNTIF(N191:N252,90)","v":0},{"$f":"+COUNTIF(O191:O252,\"INT\")","v":0},{"$f":"+COUNTIF(P191:P252,1)","v":0},"Intermedi",null,"Inter. Loop","Intermedi Max","Distanza Int",null,"Punto angolo","[kN]","[kN]","[kN]","[kN]","[kN]","[kN]",null,null,"-","-",null,"°"]
[null,{"$f":"IF(C190=\"\",\"\",_xlfn.CONCAT(C190,\", \",F11))","v":""},{"$f":"IF(OR(D36=End,D36=Loop),F35,C36)","v":""},{"$f":"IF(D35=\"\",\"\",D35)","v":""},{"$f":"+I35","v":{"v":0,"d":"0.00"}},{"$f":"IF(OR(D191=End,D191=Loop,D191=\"\"),0,IF(D191<>Angle,VLOOKUP(D191,Angoli,2,FALSE),G35))","v":0},{"$f":"+IF(D191=Loop,SQRT((H191-$H$190)^2+(I191-$I$190)^2),0)","v":{"v":0,"d":"0.00"}},{"$f":"_xlfn.IFS($D191=Angle,(E191*J191)+H190,$D191=Loop,$H$190,OR($D191=\"\",$D191=End),H190,OR($D191=Dx,$D191=sx,$D191=up,$D191=down),(E191*J191)+H190)","v":{"v":0,"d":"0.00"}},{"$f":"_xlfn.IFS($D191=Angle,(E191*K191)+I190,$D191=Loop,$I$190,OR($D191=\"\",$D191=End),I190,OR($D191=Dx,$D191=sx,$D191=up,$D191=down),(E191*K191)+I190)","v":{"v":0,"d":"0.00"}},{"$f":"+COS(RADIANS(F191))","v":{"v":1,"d":"1.0000"}},{"$f":"SIN(RADIANS(F191))","v":{"v":0,"d":"0.0000"}},{"$f":"AI191","v":{"v":0,"d":"0.00"}},{"$f":"IF(D192=Loop,ABS(180-ABS(L192-F191)),IF(AND(H191=H192,I191=I192),\"\",ABS(180-ABS(F192-F191))))","v":""},{"$f":"IF(M191=\"\",\"\",+IF(OR(AND(M191>=80,M191<=105),AND(M191>=265,M191<=280)),\"90\",FALSE))","v":""},{"$f":"IF(M191=\"\",\"\",+IF(OR(AND(M191>=165,M191<=195),AND(M191>=345,M191<=15)),\"INT\",FALSE))","v":""},{"$f":"IF(M191=\"\",\"\",IF(M191=\"\",\"\",+IF(AND(N191=FALSE,O191=FALSE),1,0)))","v":""},{"$f":"+IF(OR(E191=0,E191=\"\"),0,IF(MOD(E191,$S$189),_xlfn.FLOOR.MATH(E191/$S$189),_xlfn.FLOOR.MATH(E191/$S$189)-1))","v":0},null,{"$f":"+IF(G191=0,0,IF(MOD(G191,SpanTow),_xlfn.FLOOR.MATH(G191/SpanTow),_xlfn.FLOOR.MATH(G191/SpanTow)-1))","v":0},{"$f":"+MAX(Q191:S191)","v":0},{"$f":"IF(C191=\"\",0,IF(AND(E191=0,G191=0),0,IF(E191<>0,E191/(T191+1),G191/(T191+1))))","v":{"v":0,"d":"0.00"}},null,{"$f":"IF(D192=\"\",FALSE,IF(OR(AND(H191-H190=0,H192-H191=0),AND(I191-I190=0,I192-I191=0)),FALSE,TRUE))","v":false},{"$f":"IF(OR(D191=Loop,D191=\"Fine\",AND(D191=\"\",D192=\"\")),FALSE,_xlfn.FORECAST.LINEAR(ProjSpan,FxDb,SpanDB))","v":false},{"$f":"IF(X191=FALSE,FALSE,ABS(X191*(COS(RADIANS(F192))-COS(RADIANS(F191)))))","v":false},{"$f":"IF(X191=FALSE,FALSE,ABS(X191*(SIN(RADIANS(F192))-SIN(RADIANS(F191)))))","v":false},{"$f":"IF(OR(D192=\"\",AND(D191=\"\",D192=\"\")),FALSE,IF(D192=\"\",X191,IF(SQRT(Y191^2+Z191^2)>X191*SQRT(2),X191*SQRT(2),SQRT(Y191^2+Z191^2))))","v":false},{"$f":"IF(AA191=FALSE,FALSE,IF(SQRT(Y191^2+Z191^2)>X191*SQRT(2),X191,Y191))","v":false},{"$f":"IF(AA191=FALSE,FALSE,IF(SQRT(Y191^2+Z191^2)>X191*SQRT(2),X191,Z191))","v":false},null,null,{"$f":"H191-H190","v":{"v":0,"d":"0.00"}},{"$f":"I191-I190","v":{"v":0,"d":"0.00"}},{"$f":"IFERROR(IF(AND(AF191=0,AG191>0),90,IF(AND(AF191=0,AG191<0),270,IF(AND(AF191>0,AG191=0),0,IF(AND(AF191<0,AG191=0),180,DEGREES(ATAN((AG191)/(AF191))))))),0)","v":0},{"$f":"IF(OR(AF191=0,AG191=0),AH191,IF(AND(AF191>=0,AG191>=0),AH191,IF(AND(AF191>0,AG191<0),360+AH191,IF(AND(AF191<0,AG191<0),180+AH191,IF(AND(AF191<0,AG191>0),180-AH191,FALSE)))))","v":0}]
[null,{"$f":"_xlfn.IFS(C191=\"\",\"\",C191=\"\",\"\",AND(D192<>End,D191<>Loop),C191,D192=End,_xlfn.CONCAT(C191,\", \"&$F$11),D191=Loop,_xlfn.CONCAT($F$11&\" x2,1\"))","v":""},{"$f":"IF(OR(D36=End,D36=Loop),F36,C37)","v":""},"",{"$f":"IF(D191=Loop,$E$191,+I36)","v":{"v":0,"d":"0.00"}},{"$f":"IF(D191=Loop,$F$191,IF(OR(D192=End,D192=Loop,D192=\"\"),0,IF(D192<>Angle,VLOOKUP(D192,Angoli,2,FALSE),G36)))","v":0},{"$f":"IF(D191=Loop,$G$191,+IF(D192=Loop,SQRT((H192-H191)^2+(I192-I191)^2),0))","v":{"v":0,"d":"0.00"}},{"$f":"IF(D191=Loop,$H$191,_xlfn.IFS($D192=Angle,(E192*J192)+H191,$D192=Loop,$H$190,OR($D192=\"\",$D192=End),H191,OR($D192=Dx,$D192=sx,$D192=up,$D192=down),(E192*J192)+H191))","v":{"v":0,"d":"0.00"}},{"$f":"IF(D191=Loop,$I$191,_xlfn.IFS($D192=Angle,(E192*K192)+I191,$D192=Loop,$I$190,OR($D192=\"\",$D192=End),I191,OR($D192=Dx,$D192=sx,$D192=up,$D192=down),(E192*K192)+I191))","v":{"v":0,"d":"0.00"}},{"v":1,"d":"1.0000"},{"v":0,"d":"0.0000"},{"$f":"AI192","v":{"v":0,"d":"0.00"}},{"$f":"IF(D192=Loop,ABS(180-ABS(F193-L192)),IF(D193=Loop,(ABS(180-(L193-F192))),IF(AND(H192=H193,I192=I193),\"\",ABS(180-ABS(F193-F192)))))","v":""},"",{"$f":"IF(M192=\"\",\"\",+IF(OR(AND(M192>=165,M192<=195),AND(M192>=345,M192<=15)),\"INT\",FALSE))","v":""},{"$f":"IF(M192=\"\",\"\",IF(M192=\"\",\"\",+IF(AND(N192=FALSE,O192=FALSE),1,0)))","v":""},0,null,{"$f":"+IF(G192=0,0,IF(MOD(G192,SpanTow),_xlfn.FLOOR.MATH(G192/SpanTow),_xlfn.FLOOR.MATH(G192/SpanTow)-1))","v":0},0,{"$f":"IF(C192=\"\",0,IF(AND(E192=0,G192=0),0,IF(E192<>0,E192/(T192+1),G192/(T192+1))))","v":{"v":0,"d":"0.00"}},null,{"$f":"IF(D193=\"\",FALSE,IF(OR(AND(H192-H191=0,H193-H192=0),AND(I192-I191=0,I193-I192=0)),FALSE,TRUE))","v":false},false,{"$f":"IF(X192=FALSE,FALSE,ABS(X192*(COS(RADIANS(F193))-COS(RADIANS(F192)))))","v":false},{"$f":"IF(X192=FALSE,FALSE,ABS(X192*(SIN(RADIANS(F193))-SIN(RADIANS(F192)))))","v":false},{"$f":"IF(AND(D192=\"\",D193=\"\"),FALSE,IF(D193=\"\",X192,IF(SQRT(Y192^2+Z192^2)>X192*SQRT(2),X192*SQRT(2),SQRT(Y192^2+Z192^2))))","v":false},{"$f":"IF(AA192=FALSE,FALSE,IF(SQRT(Y192^2+Z192^2)>X192*SQRT(2),X192,Y192))","v":false},{"$f":"IF(AA192=FALSE,FALSE,IF(SQRT(Y192^2+Z192^2)>X192*SQRT(2),X192,Z192))","v":false},null,null,{"$f":"H192-H191","v":{"v":0,"d":"0.00"}},{"v":0,"d":"0.00"},0,{"$f":"IF(OR(AF192=0,AG192=0),AH192,IF(AND(AF192>=0,AG192>=0),AH192,IF(AND(AF192>0,AG192<0),360+AH192,IF(AND(AF192<0,AG192<0),180+AH192,IF(AND(AF192<0,AG192>0),180-AH192,FALSE)))))","v":0}]
[null,{"$f":"_xlfn.IFS(C192=\"\",\"\",C192=\"\",\"\",AND(D193<>End,D192<>Loop),C192,D193=End,_xlfn.CONCAT(C192,\", \"&$F$11),D192=Loop,_xlfn.CONCAT($F$11&\" x2,1\"))","v":""},"","",{"v":0,"d":"0.00"},0,{"v":0,"d":"0.00"},{"$f":"IF(D192=Loop,$H$191,_xlfn.IFS($D193=Angle,(E193*J193)+H192,$D193=Loop,$H$190,OR($D193=\"\",$D193=End),H192,OR($D193=Dx,$D193=sx,$D193=up,$D193=down),(E193*J193)+H192))","v":{"v":0,"d":"0.00"}},{"$f":"IF(D192=Loop,$I$191,_xlfn.IFS($D193=Angle,(E193*K193)+I192,$D193=Loop,$I$190,OR($D193=\"\",$D193=End),I192,OR($D193=Dx,$D193=sx,$D193=up,$D193=down),(E193*K193)+I192))","v":{"v":0,"d":"0.00"}},{"v":1,"d":"1.0000"},{"v":0,"d":"0.0000"},{"v":0,"d":"0.00"},{"$f":"IF(D193=Loop,ABS(180-ABS(F194-L193)),IF(D194=Loop,(ABS(180-(L194-F193))),IF(AND(H193=H194,I193=I194),\"\",ABS(180-ABS(F194-F193)))))","v":""},"","","",0,null,{"$f":"+IF(G193=0,0,IF(MOD(G193,SpanTow),_xlfn.FLOOR.MATH(G193/SpanTow),_xlfn.FLOOR.MATH(G193/SpanTow)-1))","v":0},0,{"v":0,"d":"0.00"},null,false,false,false,false,false,false,false,null,null,{"$f":"H193-H192","v":{"v":0,"d":"0.00"}},{"$f":"I193-I192","v":{"v":0,"d":"0.00"}},0,0]
[null,{"$f":"_xlfn.IFS(C193=\"\",\"\",C193=\"\",\"\",AND(D194<>End,D193<>Loop),C193,D194=End,_xlfn.CONCAT(C193,\", \"&$F$11),D193=Loop,_xlfn.CONCAT($F$11&\" x2,1\"))","v":""},"","",{"v":0,"d":"0.00"},0,{"v":0,"d":"0.00"},{"$f":"IF(D193=Loop,$H$191,_xlfn.IFS($D194=Angle,(E194*J194)+H193,$D194=Loop,$H$190,OR($D194=\"\",$D194=End),H193,OR($D194=Dx,$D194=sx,$D194=up,$D194=down),(E194*J194)+H193))","v":{"v":0,"d":"0.00"}},{"$f":"IF(D193=Loop,$I$191,_xlfn.IFS($D194=Angle,(E194*K194)+I193,$D194=Loop,$I$190,OR($D194=\"\",$D194=End),I193,OR($D194=Dx,$D194=sx,$D194=up,$D194=down),(E194*K194)+I193))","v":{"v":0,"d":"0.00"}},{"v":1,"d":"1.0000"},{"v":0,"d":"0.0000"},{"v":0,"d":"0.00"},{"$f":"IF(D194=Loop,ABS(180-ABS(F195-L194)),IF(D195=Loop,(ABS(180-(L195-F194))),IF(AND(H194=H195,I194=I195),\"\",ABS(180-ABS(F195-F194)))))","v":""},"","","",0,null,{"$f":"+IF(G194=0,0,IF(MOD(G194,SpanTow),_xlfn.FLOOR.MATH(G194/SpanTow),_xlfn.FLOOR.MATH(G194/SpanTow)-1))","v":0},0,{"v":0,"d":"0.00"},null,false,false,false,false,false,false,false,null,null,{"v":0,"d":"0.00"},{"v":0,"d":"0.00"},0,0]
[null,{"$f":"_xlfn.IFS(C194=\"\",\"\",C194=\"\",\"\",AND(D195<>End,D194<>Loop),C194,D195=End,_xlfn.CONCAT(C194,\", \"&$F$11),D194=Loop,_xlfn.CONCAT($F$11&\" x2,1\"))","v":""},"","",{"v":0,"d":"0.00"},0,{"v":0,"d":"0.00"},{"$f":"IF(D194=Loop,$H$191,_xlfn.IFS($D195=Angle,(E195*J195)+H194,$D195=Loop,$H$190,OR($D195=\"\",$D195=End),H194,OR($D195=Dx,$D195=sx,$D195=up,$D195=down),(E195*J195)+H194))","v":{"v":0,"d":"0.00"}},{"$f":"IF(D194=Loop,$I$191,_xlfn.IFS($D195=Angle,(E195*K195)+I194,$D195=Loop,$I$190,OR($D195=\"\",$D195=End),I194,OR($D195=Dx,$D195=sx,$D195=up,$D195=down),(E195*K195)+I194))","v":{"v":0,"d":"0.00"}},{"v":1,"d":"1.0000"},{"v":0,"d":"0.0000"},{"v":0,"d":"0.00"},"","","","",0,null,{"$f":"+IF(G195=0,0,IF(MOD(G195,SpanTow),_xlfn.FLOOR.MATH(G195/SpanTow),_xlfn.FLOOR.MATH(G195/SpanTow)-1))","v":0},0,{"v":0,"d":"0.00"},null,false,false,false,false,false,false,false,null,null,{"v":0,"d":"0.00"},{"v":0,"d":"0.00"},0,0]
[null,{"$f":"_xlfn.IFS(C195=\"\",\"\",C195=\"\",\"\",AND(D196<>End,D195<>Loop),C195,D196=End,_xlfn.CONCAT(C195,\", \"&$F$11),D195=Loop,_xlfn.CONCAT($F$11&\" x2,1\"))","v":""},"","",{"v":0,"d":"0.00"},0,{"v":0,"d":"0.00"},{"$f":"IF(D195=Loop,$H$191,_xlfn.IFS($D196=Angle,(E196*J196)+H195,$D196=Loop,$H$190,OR($D196=\"\",$D196=End),H195,OR($D196=Dx,$D196=sx,$D196=up,$D196=down),(E196*J196)+H195))","v":{"v":0,"d":"0.00"}},{"$f":"IF(D195=Loop,$I$191,_xlfn.IFS($D196=Angle,(E196*K196)+I195,$D196=Loop,$I$190,OR($D196=\"\",$D196=End),I195,OR($D196=Dx,$D196=sx,$D196=up,$D196=down),(E196*K196)+I195))","v":{"v":0,"d":"0.00"}},{"v":1,"d":"1.0000"},{"v":0,"d":"0.0000"},{"v":0,"d":"0.00"},"","","","",0,null,{"$f":"+IF(G196=0,0,IF(MOD(G196,SpanTow),_xlfn.FLOOR.MATH(G196/SpanTow),_xlfn.FLOOR.MATH(G196/SpanTow)-1))","v":0},0,{"v":0,"d":"0.00"},null,false,false,false,false,false,false,false,null,null,{"v":0,"d":"0.00"},{"v":0,"d":"0.00"},0,0]
[null,{"$f":"_xlfn.IFS(C196=\"\",\"\",C196=\"\",\"\",AND(D197<>End,D196<>Loop),C196,D197=End,_xlfn.CONCAT(C196,\", \"&$F$11),D196=Loop,_xlfn.CONCAT($F$11&\" x2,1\"))","v":""},"","",{"v":0,"d":"0.00"},0,{"v":0,"d":"0.00"},{"$f":"IF(D196=Loop,$H$191,_xlfn.IFS($D197=Angle,(E197*J197)+H196,$D197=Loop,$H$190,OR($D197=\"\",$D197=End),H196,OR($D197=Dx,$D197=sx,$D197=up,$D197=down),(E197*J197)+H196))","v":{"v":0,"d":"0.00"}},{"$f":"IF(D196=Loop,$I$191,_xlfn.IFS($D197=Angle,(E197*K197)+I196,$D197=Loop,$I$190,OR($D197=\"\",$D197=End),I196,OR($D197=Dx,$D197=sx,$D197=up,$D197=down),(E197*K197)+I196))","v":{"v":0,"d":"0.00"}},{"v":1,"d":"1.0000"},{"v":0,"d":"0.0000"},{"v":0,"d":"0.00"},"","","","",0,null,{"$f":"+IF(G197=0,0,IF(MOD(G197,SpanTow),_xlfn.FLOOR.MATH(G197/SpanTow),_xlfn.FLOOR.MATH(G197/SpanTow)-1))","v":0},0,{"v":0,"d":"0.00"},null,false,false,false,false,false,false,false,null,null,{"v":0,"d":"0.00"},{"v":0,"d":"0.00"},0,0]
[null,{"$f":"_xlfn.IFS(C197=\"\",\"\",C197=\"\",\"\",AND(D198<>End,D197<>Loop),C197,D198=End,_xlfn.CONCAT(C197,\", \"&$F$11),D197=Loop,_xlfn.CONCAT($F$11&\" x2,1\"))","v":""},"","",{"v":0,"d":"0.00"},0,{"v":0,"d":"0.00"},{"$f":"IF(D197=Loop,$H$191,_xlfn.IFS($D198=Angle,(E198*J198)+H197,$D198=Loop,$H$190,OR($D198=\"\",$D198=End),H197,OR($D198=Dx,$D198=sx,$D198=up,$D198=down),(E198*J198)+H197))","v":{"v":0,"d":"0.00"}},{"$f":"IF(D197=Loop,$I$191,_xlfn.IFS($D198=Angle,(E198*K198)+I197,$D198=Loop,$I$190,OR($D198=\"\",$D198=End),I197,OR($D198=Dx,$D198=sx,$D198=up,$D198=down),(E198*K198)+I197))","v":{"v":0,"d":"0.00"}},{"v":1,"d":"1.0000"},{"v":0,"d":"0.0000"},{"v":0,"d":"0.00"},"","","","",0,null,{"$f":"+IF(G198=0,0,IF(MOD(G198,SpanTow),_xlfn.FLOOR.MATH(G198/SpanTow),_xlfn.FLOOR.MATH(G198/SpanTow)-1))","v":0},0,{"v":0,"d":"0.00"},null,false,false,false,false,false,false,false,null,null,{"v":0,"d":"0.00"},{"v":0,"d":"0.00"},{"$f":"IFERROR(IF(AND(AF198=0,AG198>0),90,IF(AND(AF198=0,AG198<0),270,IF(AND(AF198>0,AG198=0),0,IF(AND(AF198<0,AG198=0),180,DEGREES(ATAN((AG198)/(AF198))))))),0)","v":0},0]
[null,{"$f":"_xlfn.IFS(C198=\"\",\"\",C198=\"\",\"\",AND(D199<>End,D198<>Loop),C198,D199=End,_xlfn.CONCAT(C198,\", \"&$F$11),D198=Loop,_xlfn.CONCAT($F$11&\" x2,1\"))","v":""},"","",{"v":0,"d":"0.00"},0,{"v":0,"d":"0.00"},{"$f":"IF(D198=Loop,$H$191,_xlfn.IFS($D199=Angle,(E199*J199)+H198,$D199=Loop,$H$190,OR($D199=\"\",$D199=End),H198,OR($D199=Dx,$D199=sx,$D199=up,$D199=down),(E199*J199)+H198))","v":{"v":0,"d":"0.00"}},{"$f":"IF(D198=Loop,$I$191,_xlfn.IFS($D199=Angle,(E199*K199)+I198,$D199=Loop,$I$190,OR($D199=\"\",$D199=End),I198,OR($D199=Dx,$D199=sx,$D199=up,$D199=down),(E199*K199)+I198))","v":{"v":0,"d":"0.00"}},{"v":1,"d":"1.0000"},{"v":0,"d":"0.0000"},{"v":0,"d":"0.00"},"","","","",0,null,{"$f":"+IF(G199=0,0,IF(MOD(G199,SpanTow),_xlfn.FLOOR.MATH(G199/SpanTow),_xlfn.FLOOR.MATH(G199/SpanTow)-1))","v":0},0,{"v":0,"d":"0.00"},null,false,false,false,false,false,false,false,null,null,{"v":0,"d":"0.00"},{"v":0,"d":"0.00"},{"$f":"IFERROR(IF(AND(AF199=0,AG199>0),90,IF(AND(AF199=0,AG199<0),270,IF(AND(AF199>0,AG199=0),0,IF(AND(AF199<0,AG199=0),180,DEGREES(ATAN((AG199)/(AF199))))))),0)","v":0},0]
[null,{"$f":"_xlfn.IFS(C199=\"\",\"\",C199=\"\",\"\",AND(D200<>End,D199<>Loop),C199,D200=End,_xlfn.CONCAT(C199,\", \"&$F$11),D199=Loop,_xlfn.CONCAT($F$11&\" x2,1\"))","v":""},"","",{"v":0,"d":"0.00"},0,{"v":0,"d":"0.00"},{"$f":"IF(D199=Loop,$H$191,_xlfn.IFS($D200=Angle,(E200*J200)+H199,$D200=Loop,$H$190,OR($D200=\"\",$D200=End),H199,OR($D200=Dx,$D200=sx,$D200=up,$D200=down),(E200*J200)+H199))","v":{"v":0,"d":"0.00"}},{"$f":"IF(D199=Loop,$I$191,_xlfn.IFS($D200=Angle,(E200*K200)+I199,$D200=Loop,$I$190,OR($D200=\"\",$D200=End),I199,OR($D200=Dx,$D200=sx,$D200=up,$D200=down),(E200*K200)+I199))","v":{"v":0,"d":"0.00"}},{"v":1,"d":"1.0000"},{"v":0,"d":"0.0000"},{"v":0,"d":"0.00"},"","","","",0,null,{"$f":"+IF(G200=0,0,IF(MOD(G200,SpanTow),_xlfn.FLOOR.MATH(G200/SpanTow),_xlfn.FLOOR.MATH(G200/SpanTow)-1))","v":0},0,{"v":0,"d":"0.00"},null,false,false,false,false,false,false,false,null,null,{"v":0,"d":"0.00"},{"v":0,"d":"0.00"},0,0]
[null,{"$f":"_xlfn.IFS(C200=\"\",\"\",C200=\"\",\"\",AND(D201<>End,D200<>Loop),C200,D201=End,_xlfn.CONCAT(C200,\", \"&$F$11),D200=Loop,_xlfn.CONCAT($F$11&\" x2,1\"))","v":""},"","",{"v":0,"d":"0.00"},0,{"v":0,"d":"0.00"},{"$f":"IF(D200=Loop,$H$191,_xlfn.IFS($D201=Angle,(E201*J201)+H200,$D201=Loop,$H$190,OR($D201=\"\",$D201=End),H200,OR($D201=Dx,$D201=sx,$D201=up,$D201=down),(E201*J201)+H200))","v":{"v":0,"d":"0.00"}},{"$f":"IF(D200=Loop,$I$191,_xlfn.IFS($D201=Angle,(E201*K201)+I200,$D201=Loop,$I$190,OR($D201=\"\",$D201=End),I200,OR($D201=Dx,$D201=sx,$D201=up,$D201=down),(E201*K201)+I200))","v":{"v":0,"d":"0.00"}},{"v":1,"d":"1.0000"},{"v":0,"d":"0.0000"},{"v":0,"d":"0.00"},"","","","",0,null,{"$f":"+IF(G201=0,0,IF(MOD(G201,SpanTow),_xlfn.FLOOR.MATH(G201/SpanTow),_xlfn.FLOOR.MATH(G201/SpanTow)-1))","v":0},{"$f":"+MAX(Q201:S201)","v":0},{"v":0,"d":"0.00"},null,false,false,false,false,false,false,false,null,null,{"v":0,"d":"0.00"},{"v":0,"d":"0.00"},0,0]
[null,{"$f":"_xlfn.IFS(C201=\"\",\"\",C201=\"\",\"\",AND(D202<>End,D201<>Loop),C201,D202=End,_xlfn.CONCAT(C201,\", \"&$F$11),D201=Loop,_xlfn.CONCAT($F$11&\" x2,1\"))","v":""},"","",{"v":0,"d":"0.00"},0,{"v":0,"d":"0.00"},{"$f":"IF(D201=Loop,$H$191,_xlfn.IFS($D202=Angle,(E202*J202)+H201,$D202=Loop,$H$190,OR($D202=\"\",$D202=End),H201,OR($D202=Dx,$D202=sx,$D202=up,$D202=down),(E202*J202)+H201))","v":{"v":0,"d":"0.00"}},{"$f":"IF(D201=Loop,$I$191,_xlfn.IFS($D202=Angle,(E202*K202)+I201,$D202=Loop,$I$190,OR($D202=\"\",$D202=End),I201,OR($D202=Dx,$D202=sx,$D202=up,$D202=down),(E202*K202)+I201))","v":{"v":0,"d":"0.00"}},{"v":1,"d":"1.0000"},{"v":0,"d":"0.0000"},{"v":0,"d":"0.00"},"","","","",0,null,{"$f":"+IF(G202=0,0,IF(MOD(G202,SpanTow),_xlfn.FLOOR.MATH(G202/SpanTow),_xlfn.FLOOR.MATH(G202/SpanTow)-1))","v":0},0,{"v":0,"d":"0.00"},null,false,false,false,false,false,false,false,null,null,{"v":0,"d":"0.00"},{"v":0,"d":"0.00"},0,0]
[null,{"$f":"_xlfn.IFS(C202=\"\",\"\",C202=\"\",\"\",AND(D203<>End,D202<>Loop),C202,D203=End,_xlfn.CONCAT(C202,\", \"&$F$11),D202=Loop,_xlfn.CONCAT($F$11&\" x2,1\"))","v":""},"","",{"v":0,"d":"0.00"},0,{"v":0,"d":"0.00"},{"$f":"IF(D202=Loop,$H$191,_xlfn.IFS($D203=Angle,(E203*J203)+H202,$D203=Loop,$H$190,OR($D203=\"\",$D203=End),H202,OR($D203=Dx,$D203=sx,$D203=up,$D203=down),(E203*J203)+H202))","v":{"v":0,"d":"0.00"}},{"$f":"IF(D202=Loop,$I$191,_xlfn.IFS($D203=Angle,(E203*K203)+I202,$D203=Loop,$I$190,OR($D203=\"\",$D203=End),I202,OR($D203=Dx,$D203=sx,$D203=up,$D203=down),(E203*K203)+I202))","v":{"v":0,"d":"0.00"}},{"v":1,"d":"1.0000"},{"v":0,"d":"0.0000"},{"v":0,"d":"0.00"},"","","","",0,null,{"$f":"+IF(G203=0,0,IF(MOD(G203,SpanTow),_xlfn.FLOOR.MATH(G203/SpanTow),_xlfn.FLOOR.MATH(G203/SpanTow)-1))","v":0},0,{"v":0,"d":"0.00"},null,false,false,false,false,false,false,false,null,null,{"v":0,"d":"0.00"},{"v":0,"d":"0.00"},0,0]
[null,{"$f":"_xlfn.IFS(C203=\"\",\"\",C203=\"\",\"\",AND(D204<>End,D203<>Loop),C203,D204=End,_xlfn.CONCAT(C203,\", \"&$F$11),D203=Loop,_xlfn.CONCAT($F$11&\" x2,1\"))","v":""},"","",{"v":0,"d":"0.00"},0,{"v":0,"d":"0.00"},{"$f":"IF(D203=Loop,$H$191,_xlfn.IFS($D204=Angle,(E204*J204)+H203,$D204=Loop,$H$190,OR($D204=\"\",$D204=End),H203,OR($D204=Dx,$D204=sx,$D204=up,$D204=down),(E204*J204)+H203))","v":{"v":0,"d":"0.00"}},{"$f":"IF(D203=Loop,$I$191,_xlfn.IFS($D204=Angle,(E204*K204)+I203,$D204=Loop,$I$190,OR($D204=\"\",$D204=End),I203,OR($D204=Dx,$D204=sx,$D204=up,$D204=down),(E204*K204)+I203))","v":{"v":0,"d":"0.00"}},{"v":1,"d":"1.0000"},{"v":0,"d":"0.0000"},{"v":0,"d":"0.00"},"","","","",0,null,{"$f":"+IF(G204=0,0,IF(MOD(G204,SpanTow),_xlfn.FLOOR.MATH(G204/SpanTow),_xlfn.FLOOR.MATH(G204/SpanTow)-1))","v":0},0,{"v":0,"d":"0.00"},null,false,false,false,false,false,false,false,null,null,{"v":0,"d":"0.00"},{"v":0,"d":"0.00"},0,0]
[null,{"$f":"_xlfn.IFS(C204=\"\",\"\",C204=\"\",\"\",AND(D205<>End,D204<>Loop),C204,D205=End,_xlfn.CONCAT(C204,\", \"&$F$11),D204=Loop,_xlfn.CONCAT($F$11&\" x2,1\"))","v":""},"","",{"v":0,"d":"0.00"},0,{"v":0,"d":"0.00"},{"$f":"IF(D204=Loop,$H$191,_xlfn.IFS($D205=Angle,(E205*J205)+H204,$D205=Loop,$H$190,OR($D205=\"\",$D205=End),H204,OR($D205=Dx,$D205=sx,$D205=up,$D205=down),(E205*J205)+H204))","v":{"v":0,"d":"0.00"}},{"$f":"IF(D204=Loop,$I$191,_xlfn.IFS($D205=Angle,(E205*K205)+I204,$D205=Loop,$I$190,OR($D205=\"\",$D205=End),I204,OR($D205=Dx,$D205=sx,$D205=up,$D205=down),(E205*K205)+I204))","v":{"v":0,"d":"0.00"}},{"v":1,"d":"1.0000"},{"v":0,"d":"0.0000"},{"v":0,"d":"0.00"},"","","","",0,null,{"$f":"+IF(G205=0,0,IF(MOD(G205,SpanTow),_xlfn.FLOOR.MATH(G205/SpanTow),_xlfn.FLOOR.MATH(G205/SpanTow)-1))","v":0},0,{"v":0,"d":"0.00"},null,false,false,false,false,false,false,false,null,null,{"v":0,"d":"0.00"},{"v":0,"d":"0.00"},0,0]
[null,{"$f":"_xlfn.IFS(C205=\"\",\"\",C205=\"\",\"\",AND(D206<>End,D205<>Loop),C205,D206=End,_xlfn.CONCAT(C205,\", \"&$F$11),D205=Loop,_xlfn.CONCAT($F$11&\" x2,1\"))","v":""},"","",{"v":0,"d":"0.00"},0,{"v":0,"d":"0.00"},{"$f":"IF(D205=Loop,$H$191,_xlfn.IFS($D206=Angle,(E206*J206)+H205,$D206=Loop,$H$190,OR($D206=\"\",$D206=End),H205,OR($D206=Dx,$D206=sx,$D206=up,$D206=down),(E206*J206)+H205))","v":{"v":0,"d":"0.00"}},{"$f":"IF(D205=Loop,$I$191,_xlfn.IFS($D206=Angle,(E206*K206)+I205,$D206=Loop,$I$190,OR($D206=\"\",$D206=End),I205,OR($D206=Dx,$D206=sx,$D206=up,$D206=down),(E206*K206)+I205))","v":{"v":0,"d":"0.00"}},{"v":1,"d":"1.0000"},{"v":0,"d":"0.0000"},{"v":0,"d":"0.00"},"","","","",0,null,{"$f":"+IF(G206=0,0,IF(MOD(G206,SpanTow),_xlfn.FLOOR.MATH(G206/SpanTow),_xlfn.FLOOR.MATH(G206/SpanTow)-1))","v":0},0,{"v":0,"d":"0.00"},null,false,false,false,false,false,false,false,null,null,{"v":0,"d":"0.00"},{"v":0,"d":"0.00"},0,0]
[null,{"$f":"_xlfn.IFS(C206=\"\",\"\",C206=\"\",\"\",AND(D207<>End,D206<>Loop),C206,D207=End,_xlfn.CONCAT(C206,\", \"&$F$11),D206=Loop,_xlfn.CONCAT($F$11&\" x2,1\"))","v":""},"","",{"v":0,"d":"0.00"},0,{"v":0,"d":"0.00"},{"$f":"IF(D206=Loop,$H$191,_xlfn.IFS($D207=Angle,(E207*J207)+H206,$D207=Loop,$H$190,OR($D207=\"\",$D207=End),H206,OR($D207=Dx,$D207=sx,$D207=up,$D207=down),(E207*J207)+H206))","v":{"v":0,"d":"0.00"}},{"$f":"IF(D206=Loop,$I$191,_xlfn.IFS($D207=Angle,(E207*K207)+I206,$D207=Loop,$I$190,OR($D207=\"\",$D207=End),I206,OR($D207=Dx,$D207=sx,$D207=up,$D207=down),(E207*K207)+I206))","v":{"v":0,"d":"0.00"}},{"v":1,"d":"1.0000"},{"v":0,"d":"0.0000"},{"v":0,"d":"0.00"},"","","","",0,null,{"$f":"+IF(G207=0,0,IF(MOD(G207,SpanTow),_xlfn.FLOOR.MATH(G207/SpanTow),_xlfn.FLOOR.MATH(G207/SpanTow)-1))","v":0},0,{"v":0,"d":"0.00"},null,false,false,false,false,false,false,false,null,null,{"v":0,"d":"0.00"},{"v":0,"d":"0.00"},0,0]
[null,{"$f":"_xlfn.IFS(C207=\"\",\"\",C207=\"\",\"\",AND(D208<>End,D207<>Loop),C207,D208=End,_xlfn.CONCAT(C207,\", \"&$F$11),D207=Loop,_xlfn.CONCAT($F$11&\" x2,1\"))","v":""},"","",{"v":0,"d":"0.00"},0,{"v":0,"d":"0.00"},{"$f":"IF(D207=Loop,$H$191,_xlfn.IFS($D208=Angle,(E208*J208)+H207,$D208=Loop,$H$190,OR($D208=\"\",$D208=End),H207,OR($D208=Dx,$D208=sx,$D208=up,$D208=down),(E208*J208)+H207))","v":{"v":0,"d":"0.00"}},{"$f":"IF(D207=Loop,$I$191,_xlfn.IFS($D208=Angle,(E208*K208)+I207,$D208=Loop,$I$190,OR($D208=\"\",$D208=End),I207,OR($D208=Dx,$D208=sx,$D208=up,$D208=down),(E208*K208)+I207))","v":{"v":0,"d":"0.00"}},{"v":1,"d":"1.0000"},{"v":0,"d":"0.0000"},{"v":0,"d":"0.00"},"","","","",0,null,{"$f":"+IF(G208=0,0,IF(MOD(G208,SpanTow),_xlfn.FLOOR.MATH(G208/SpanTow),_xlfn.FLOOR.MATH(G208/SpanTow)-1))","v":0},0,{"v":0,"d":"0.00"},null,false,false,false,false,false,false,false,null,null,{"v":0,"d":"0.00"},{"v":0,"d":"0.00"},0,0]
[null,{"$f":"_xlfn.IFS(C208=\"\",\"\",C208=\"\",\"\",AND(D209<>End,D208<>Loop),C208,D209=End,_xlfn.CONCAT(C208,\", \"&$F$11),D208=Loop,_xlfn.CONCAT($F$11&\" x2,1\"))","v":""},"","",{"v":0,"d":"0.00"},0,{"v":0,"d":"0.00"},{"$f":"IF(D208=Loop,$H$191,_xlfn.IFS($D209=Angle,(E209*J209)+H208,$D209=Loop,$H$190,OR($D209=\"\",$D209=End),H208,OR($D209=Dx,$D209=sx,$D209=up,$D209=down),(E209*J209)+H208))","v":{"v":0,"d":"0.00"}},{"$f":"IF(D208=Loop,$I$191,_xlfn.IFS($D209=Angle,(E209*K209)+I208,$D209=Loop,$I$190,OR($D209=\"\",$D209=End),I208,OR($D209=Dx,$D209=sx,$D209=up,$D209=down),(E209*K209)+I208))","v":{"v":0,"d":"0.00"}},{"v":1,"d":"1.0000"},{"v":0,"d":"0.0000"},{"v":0,"d":"0.00"},"","","","",0,null,{"$f":"+IF(G209=0,0,IF(MOD(G209,SpanTow),_xlfn.FLOOR.MATH(G209/SpanTow),_xlfn.FLOOR.MATH(G209/SpanTow)-1))","v":0},0,{"v":0,"d":"0.00"},null,false,false,false,false,false,false,false,null,null,{"v":0,"d":"0.00"},{"v":0,"d":"0.00"},0,0]
[null,{"$f":"_xlfn.IFS(C209=\"\",\"\",C209=\"\",\"\",AND(D210<>End,D209<>Loop),C209,D210=End,_xlfn.CONCAT(C209,\", \"&$F$11),D209=Loop,_xlfn.CONCAT($F$11&\" x2,1\"))","v":""},"","",{"v":0,"d":"0.00"},0,{"v":0,"d":"0.00"},{"$f":"IF(D209=Loop,$H$191,_xlfn.IFS($D210=Angle,(E210*J210)+H209,$D210=Loop,$H$190,OR($D210=\"\",$D210=End),H209,OR($D210=Dx,$D210=sx,$D210=up,$D210=down),(E210*J210)+H209))","v":{"v":0,"d":"0.00"}},{"$f":"IF(D209=Loop,$I$191,_xlfn.IFS($D210=Angle,(E210*K210)+I209,$D210=Loop,$I$190,OR($D210=\"\",$D210=End),I209,OR($D210=Dx,$D210=sx,$D210=up,$D210=down),(E210*K210)+I209))","v":{"v":0,"d":"0.00"}},{"v":1,"d":"1.0000"},{"v":0,"d":"0.0000"},{"v":0,"d":"0.00"},"","","","",0,null,{"$f":"+IF(G210=0,0,IF(MOD(G210,SpanTow),_xlfn.FLOOR.MATH(G210/SpanTow),_xlfn.FLOOR.MATH(G210/SpanTow)-1))","v":0},0,{"v":0,"d":"0.00"},null,false,false,false,false,false,false,false,null,null,{"v":0,"d":"0.00"},{"v":0,"d":"0.00"},0,0]
[null,{"$f":"_xlfn.IFS(C210=\"\",\"\",C210=\"\",\"\",AND(D211<>End,D210<>Loop),C210,D211=End,_xlfn.CONCAT(C210,\", \"&$F$11),D210=Loop,_xlfn.CONCAT($F$11&\" x2,1\"))","v":""},"","",{"v":0,"d":"0.00"},0,{"v":0,"d":"0.00"},{"$f":"IF(D210=Loop,$H$191,_xlfn.IFS($D211=Angle,(E211*J211)+H210,$D211=Loop,$H$190,OR($D211=\"\",$D211=End),H210,OR($D211=Dx,$D211=sx,$D211=up,$D211=down),(E211*J211)+H210))","v":{"v":0,"d":"0.00"}},{"$f":"IF(D210=Loop,$I$191,_xlfn.IFS($D211=Angle,(E211*K211)+I210,$D211=Loop,$I$190,OR($D211=\"\",$D211=End),I210,OR($D211=Dx,$D211=sx,$D211=up,$D211=down),(E211*K211)+I210))","v":{"v":0,"d":"0.00"}},{"v":1,"d":"1.0000"},{"v":0,"d":"0.0000"},{"v":0,"d":"0.00"},"","","","",0,null,{"$f":"+IF(G211=0,0,IF(MOD(G211,SpanTow),_xlfn.FLOOR.MATH(G211/SpanTow),_xlfn.FLOOR.MATH(G211/SpanTow)-1))","v":0},0,{"v":0,"d":"0.00"},null,false,false,false,false,false,false,false,null,null,{"v":0,"d":"0.00"},{"v":0,"d":"0.00"},0,0]
[null,{"$f":"_xlfn.IFS(C211=\"\",\"\",C211=\"\",\"\",AND(D212<>End,D211<>Loop),C211,D212=End,_xlfn.CONCAT(C211,\", \"&$F$11),D211=Loop,_xlfn.CONCAT($F$11&\" x2,1\"))","v":""},"","",{"v":0,"d":"0.00"},0,{"v":0,"d":"0.00"},{"$f":"IF(D211=Loop,$H$191,_xlfn.IFS($D212=Angle,(E212*J212)+H211,$D212=Loop,$H$190,OR($D212=\"\",$D212=End),H211,OR($D212=Dx,$D212=sx,$D212=up,$D212=down),(E212*J212)+H211))","v":{"v":0,"d":"0.00"}},{"$f":"IF(D211=Loop,$I$191,_xlfn.IFS($D212=Angle,(E212*K212)+I211,$D212=Loop,$I$190,OR($D212=\"\",$D212=End),I211,OR($D212=Dx,$D212=sx,$D212=up,$D212=down),(E212*K212)+I211))","v":{"v":0,"d":"0.00"}},{"v":1,"d":"1.0000"},{"v":0,"d":"0.0000"},{"v":0,"d":"0.00"},"","","","",0,null,{"$f":"+IF(G212=0,0,IF(MOD(G212,SpanTow),_xlfn.FLOOR.MATH(G212/SpanTow),_xlfn.FLOOR.MATH(G212/SpanTow)-1))","v":0},0,{"v":0,"d":"0.00"},null,false,false,false,false,false,false,false,null,null,{"v":0,"d":"0.00"},{"v":0,"d":"0.00"},0,0]
[null,{"$f":"_xlfn.IFS(C212=\"\",\"\",C212=\"\",\"\",AND(D213<>End,D212<>Loop),C212,D213=End,_xlfn.CONCAT(C212,\", \"&$F$11),D212=Loop,_xlfn.CONCAT($F$11&\" x2,1\"))","v":""},"","",{"v":0,"d":"0.00"},0,{"v":0,"d":"0.00"},{"$f":"IF(D212=Loop,$H$191,_xlfn.IFS($D213=Angle,(E213*J213)+H212,$D213=Loop,$H$190,OR($D213=\"\",$D213=End),H212,OR($D213=Dx,$D213=sx,$D213=up,$D213=down),(E213*J213)+H212))","v":{"v":0,"d":"0.00"}},{"$f":"IF(D212=Loop,$I$191,_xlfn.IFS($D213=Angle,(E213*K213)+I212,$D213=Loop,$I$190,OR($D213=\"\",$D213=End),I212,OR($D213=Dx,$D213=sx,$D213=up,$D213=down),(E213*K213)+I212))","v":{"v":0,"d":"0.00"}},{"v":1,"d":"1.0000"},{"v":0,"d":"0.0000"},{"v":0,"d":"0.00"},"","","","",0,null,{"$f":"+IF(G213=0,0,IF(MOD(G213,SpanTow),_xlfn.FLOOR.MATH(G213/SpanTow),_xlfn.FLOOR.MATH(G213/SpanTow)-1))","v":0},0,{"v":0,"d":"0.00"},null,false,false,false,false,false,false,false,null,null,{"v":0,"d":"0.00"},{"v":0,"d":"0.00"},0,0]
[null,{"$f":"_xlfn.IFS(C213=\"\",\"\",C213=\"\",\"\",AND(D214<>End,D213<>Loop),C213,D214=End,_xlfn.CONCAT(C213,\", \"&$F$11),D213=Loop,_xlfn.CONCAT($F$11&\" x2,1\"))","v":""},"","",{"v":0,"d":"0.00"},0,{"v":0,"d":"0.00"},{"$f":"IF(D213=Loop,$H$191,_xlfn.IFS($D214=Angle,(E214*J214)+H213,$D214=Loop,$H$190,OR($D214=\"\",$D214=End),H213,OR($D214=Dx,$D214=sx,$D214=up,$D214=down),(E214*J214)+H213))","v":{"v":0,"d":"0.00"}},{"$f":"IF(D213=Loop,$I$191,_xlfn.IFS($D214=Angle,(E214*K214)+I213,$D214=Loop,$I$190,OR($D214=\"\",$D214=End),I213,OR($D214=Dx,$D214=sx,$D214=up,$D214=down),(E214*K214)+I213))","v":{"v":0,"d":"0.00"}},{"v":1,"d":"1.0000"},{"v":0,"d":"0.0000"},{"v":0,"d":"0.00"},"","","","",0,null,{"$f":"+IF(G214=0,0,IF(MOD(G214,SpanTow),_xlfn.FLOOR.MATH(G214/SpanTow),_xlfn.FLOOR.MATH(G214/SpanTow)-1))","v":0},0,{"v":0,"d":"0.00"},null,false,false,false,false,false,false,false,null,null,{"v":0,"d":"0.00"},{"v":0,"d":"0.00"},0,0]
[null,{"$f":"_xlfn.IFS(C214=\"\",\"\",C214=\"\",\"\",AND(D215<>End,D214<>Loop),C214,D215=End,_xlfn.CONCAT(C214,\", \"&$F$11),D214=Loop,_xlfn.CONCAT($F$11&\" x2,1\"))","v":""},"","",{"v":0,"d":"0.00"},0,{"v":0,"d":"0.00"},{"$f":"IF(D214=Loop,$H$191,_xlfn.IFS($D215=Angle,(E215*J215)+H214,$D215=Loop,$H$190,OR($D215=\"\",$D215=End),H214,OR($D215=Dx,$D215=sx,$D215=up,$D215=down),(E215*J215)+H214))","v":{"v":0,"d":"0.00"}},{"$f":"IF(D214=Loop,$I$191,_xlfn.IFS($D215=Angle,(E215*K215)+I214,$D215=Loop,$I$190,OR($D215=\"\",$D215=End),I214,OR($D215=Dx,$D215=sx,$D215=up,$D215=down),(E215*K215)+I214))","v":{"v":0,"d":"0.00"}},{"v":1,"d":"1.0000"},{"v":0,"d":"0.0000"},{"v":0,"d":"0.00"},"","","","",0,null,{"$f":"+IF(G215=0,0,IF(MOD(G215,SpanTow),_xlfn.FLOOR.MATH(G215/SpanTow),_xlfn.FLOOR.MATH(G215/SpanTow)-1))","v":0},0,{"v":0,"d":"0.00"},null,false,false,false,false,false,false,false,null,null,{"v":0,"d":"0.00"},{"v":0,"d":"0.00"},0,0]
[null,{"$f":"_xlfn.IFS(C215=\"\",\"\",C215=\"\",\"\",AND(D216<>End,D215<>Loop),C215,D216=End,_xlfn.CONCAT(C215,\", \"&$F$11),D215=Loop,_xlfn.CONCAT($F$11&\" x2,1\"))","v":""},"","",{"v":0,"d":"0.00"},0,{"v":0,"d":"0.00"},{"$f":"IF(D215=Loop,$H$191,_xlfn.IFS($D216=Angle,(E216*J216)+H215,$D216=Loop,$H$190,OR($D216=\"\",$D216=End),H215,OR($D216=Dx,$D216=sx,$D216=up,$D216=down),(E216*J216)+H215))","v":{"v":0,"d":"0.00"}},{"$f":"IF(D215=Loop,$I$191,_xlfn.IFS($D216=Angle,(E216*K216)+I215,$D216=Loop,$I$190,OR($D216=\"\",$D216=End),I215,OR($D216=Dx,$D216=sx,$D216=up,$D216=down),(E216*K216)+I215))","v":{"v":0,"d":"0.00"}},{"v":1,"d":"1.0000"},{"v":0,"d":"0.0000"},{"v":0,"d":"0.00"},"","","","",0,null,{"$f":"+IF(G216=0,0,IF(MOD(G216,SpanTow),_xlfn.FLOOR.MATH(G216/SpanTow),_xlfn.FLOOR.MATH(G216/SpanTow)-1))","v":0},0,{"v":0,"d":"0.00"},null,false,false,false,false,false,false,false,null,null,{"v":0,"d":"0.00"},{"v":0,"d":"0.00"},0,0]
[null,{"$f":"_xlfn.IFS(C216=\"\",\"\",C216=\"\",\"\",AND(D217<>End,D216<>Loop),C216,D217=End,_xlfn.CONCAT(C216,\", \"&$F$11),D216=Loop,_xlfn.CONCAT($F$11&\" x2,1\"))","v":""},"","",{"v":0,"d":"0.00"},0,{"v":0,"d":"0.00"},{"$f":"IF(D216=Loop,$H$191,_xlfn.IFS($D217=Angle,(E217*J217)+H216,$D217=Loop,$H$190,OR($D217=\"\",$D217=End),H216,OR($D217=Dx,$D217=sx,$D217=up,$D217=down),(E217*J217)+H216))","v":{"v":0,"d":"0.00"}},{"$f":"IF(D216=Loop,$I$191,_xlfn.IFS($D217=Angle,(E217*K217)+I216,$D217=Loop,$I$190,OR($D217=\"\",$D217=End),I216,OR($D217=Dx,$D217=sx,$D217=up,$D217=down),(E217*K217)+I216))","v":{"v":0,"d":"0.00"}},{"v":1,"d":"1.0000"},{"v":0,"d":"0.0000"},{"v":0,"d":"0.00"},"","","","",0,null,{"$f":"+IF(G217=0,0,IF(MOD(G217,SpanTow),_xlfn.FLOOR.MATH(G217/SpanTow),_xlfn.FLOOR.MATH(G217/SpanTow)-1))","v":0},0,{"v":0,"d":"0.00"},null,false,false,false,false,false,false,false,null,null,{"v":0,"d":"0.00"},{"v":0,"d":"0.00"},0,0]
[null,{"$f":"_xlfn.IFS(C217=\"\",\"\",C217=\"\",\"\",AND(D218<>End,D217<>Loop),C217,D218=End,_xlfn.CONCAT(C217,\", \"&$F$11),D217=Loop,_xlfn.CONCAT($F$11&\" x2,1\"))","v":""},"","",{"v":0,"d":"0.00"},0,{"v":0,"d":"0.00"},{"$f":"IF(D217=Loop,$H$191,_xlfn.IFS($D218=Angle,(E218*J218)+H217,$D218=Loop,$H$190,OR($D218=\"\",$D218=End),H217,OR($D218=Dx,$D218=sx,$D218=up,$D218=down),(E218*J218)+H217))","v":{"v":0,"d":"0.00"}},{"$f":"IF(D217=Loop,$I$191,_xlfn.IFS($D218=Angle,(E218*K218)+I217,$D218=Loop,$I$190,OR($D218=\"\",$D218=End),I217,OR($D218=Dx,$D218=sx,$D218=up,$D218=down),(E218*K218)+I217))","v":{"v":0,"d":"0.00"}},{"v":1,"d":"1.0000"},{"v":0,"d":"0.0000"},{"v":0,"d":"0.00"},"","","","",0,null,{"$f":"+IF(G218=0,0,IF(MOD(G218,SpanTow),_xlfn.FLOOR.MATH(G218/SpanTow),_xlfn.FLOOR.MATH(G218/SpanTow)-1))","v":0},0,{"v":0,"d":"0.00"},null,false,false,false,false,false,false,false,null,null,{"v":0,"d":"0.00"},{"v":0,"d":"0.00"},0,0]
[null,{"$f":"_xlfn.IFS(C218=\"\",\"\",C218=\"\",\"\",AND(D219<>End,D218<>Loop),C218,D219=End,_xlfn.CONCAT(C218,\", \"&$F$11),D218=Loop,_xlfn.CONCAT($F$11&\" x2,1\"))","v":""},"","",{"v":0,"d":"0.00"},0,{"v":0,"d":"0.00"},{"$f":"IF(D218=Loop,$H$191,_xlfn.IFS($D219=Angle,(E219*J219)+H218,$D219=Loop,$H$190,OR($D219=\"\",$D219=End),H218,OR($D219=Dx,$D219=sx,$D219=up,$D219=down),(E219*J219)+H218))","v":{"v":0,"d":"0.00"}},{"$f":"IF(D218=Loop,$I$191,_xlfn.IFS($D219=Angle,(E219*K219)+I218,$D219=Loop,$I$190,OR($D219=\"\",$D219=End),I218,OR($D219=Dx,$D219=sx,$D219=up,$D219=down),(E219*K219)+I218))","v":{"v":0,"d":"0.00"}},{"v":1,"d":"1.0000"},{"v":0,"d":"0.0000"},{"v":0,"d":"0.00"},"","","","",0,null,{"$f":"+IF(G219=0,0,IF(MOD(G219,SpanTow),_xlfn.FLOOR.MATH(G219/SpanTow),_xlfn.FLOOR.MATH(G219/SpanTow)-1))","v":0},0,{"v":0,"d":"0.00"},null,false,false,false,false,false,false,false,null,null,{"v":0,"d":"0.00"},{"v":0,"d":"0.00"},0,0]
[null,{"$f":"_xlfn.IFS(C219=\"\",\"\",C219=\"\",\"\",AND(D220<>End,D219<>Loop),C219,D220=End,_xlfn.CONCAT(C219,\", \"&$F$11),D219=Loop,_xlfn.CONCAT($F$11&\" x2,1\"))","v":""},"","",{"v":0,"d":"0.00"},0,{"v":0,"d":"0.00"},{"$f":"IF(D219=Loop,$H$191,_xlfn.IFS($D220=Angle,(E220*J220)+H219,$D220=Loop,$H$190,OR($D220=\"\",$D220=End),H219,OR($D220=Dx,$D220=sx,$D220=up,$D220=down),(E220*J220)+H219))","v":{"v":0,"d":"0.00"}},{"$f":"IF(D219=Loop,$I$191,_xlfn.IFS($D220=Angle,(E220*K220)+I219,$D220=Loop,$I$190,OR($D220=\"\",$D220=End),I219,OR($D220=Dx,$D220=sx,$D220=up,$D220=down),(E220*K220)+I219))","v":{"v":0,"d":"0.00"}},{"v":1,"d":"1.0000"},{"v":0,"d":"0.0000"},{"v":0,"d":"0.00"},"","","","",0,null,{"$f":"+IF(G220=0,0,IF(MOD(G220,SpanTow),_xlfn.FLOOR.MATH(G220/SpanTow),_xlfn.FLOOR.MATH(G220/SpanTow)-1))","v":0},0,{"v":0,"d":"0.00"},null,false,false,false,false,false,false,false,null,null,{"v":0,"d":"0.00"},{"v":0,"d":"0.00"},0,0]
[null,{"$f":"_xlfn.IFS(C220=\"\",\"\",C220=\"\",\"\",AND(D221<>End,D220<>Loop),C220,D221=End,_xlfn.CONCAT(C220,\", \"&$F$11),D220=Loop,_xlfn.CONCAT($F$11&\" x2,1\"))","v":""},"","",{"v":0,"d":"0.00"},0,{"v":0,"d":"0.00"},{"$f":"IF(D220=Loop,$H$191,_xlfn.IFS($D221=Angle,(E221*J221)+H220,$D221=Loop,$H$190,OR($D221=\"\",$D221=End),H220,OR($D221=Dx,$D221=sx,$D221=up,$D221=down),(E221*J221)+H220))","v":{"v":0,"d":"0.00"}},{"$f":"IF(D220=Loop,$I$191,_xlfn.IFS($D221=Angle,(E221*K221)+I220,$D221=Loop,$I$190,OR($D221=\"\",$D221=End),I220,OR($D221=Dx,$D221=sx,$D221=up,$D221=down),(E221*K221)+I220))","v":{"v":0,"d":"0.00"}},{"v":1,"d":"1.0000"},{"v":0,"d":"0.0000"},{"v":0,"d":"0.00"},"","","","",0,null,{"$f":"+IF(G221=0,0,IF(MOD(G221,SpanTow),_xlfn.FLOOR.MATH(G221/SpanTow),_xlfn.FLOOR.MATH(G221/SpanTow)-1))","v":0},0,{"v":0,"d":"0.00"},null,false,false,false,false,false,false,false,null,null,{"v":0,"d":"0.00"},{"v":0,"d":"0.00"},0,0]
[null,{"$f":"_xlfn.IFS(C221=\"\",\"\",C221=\"\",\"\",AND(D222<>End,D221<>Loop),C221,D222=End,_xlfn.CONCAT(C221,\", \"&$F$11),D221=Loop,_xlfn.CONCAT($F$11&\" x2,1\"))","v":""},"","",{"v":0,"d":"0.00"},0,{"v":0,"d":"0.00"},{"$f":"IF(D221=Loop,$H$191,_xlfn.IFS($D222=Angle,(E222*J222)+H221,$D222=Loop,$H$190,OR($D222=\"\",$D222=End),H221,OR($D222=Dx,$D222=sx,$D222=up,$D222=down),(E222*J222)+H221))","v":{"v":0,"d":"0.00"}},{"$f":"IF(D221=Loop,$I$191,_xlfn.IFS($D222=Angle,(E222*K222)+I221,$D222=Loop,$I$190,OR($D222=\"\",$D222=End),I221,OR($D222=Dx,$D222=sx,$D222=up,$D222=down),(E222*K222)+I221))","v":{"v":0,"d":"0.00"}},{"v":1,"d":"1.0000"},{"v":0,"d":"0.0000"},{"v":0,"d":"0.00"},"","","","",0,null,{"$f":"+IF(G222=0,0,IF(MOD(G222,SpanTow),_xlfn.FLOOR.MATH(G222/SpanTow),_xlfn.FLOOR.MATH(G222/SpanTow)-1))","v":0},0,{"v":0,"d":"0.00"},null,false,false,false,false,false,false,false,null,null,{"v":0,"d":"0.00"},{"v":0,"d":"0.00"},0,0]
[null,{"$f":"_xlfn.IFS(C222=\"\",\"\",C222=\"\",\"\",AND(D223<>End,D222<>Loop),C222,D223=End,_xlfn.CONCAT(C222,\", \"&$F$11),D222=Loop,_xlfn.CONCAT($F$11&\" x2,1\"))","v":""},"",{"$f":"IF(D67=\"\",\"\",D67)","v":""},{"v":0,"d":"0.00"},0,{"v":0,"d":"0.00"},{"$f":"IF(D222=Loop,$H$191,_xlfn.IFS($D223=Angle,(E223*J223)+H222,$D223=Loop,$H$190,OR($D223=\"\",$D223=End),H222,OR($D223=Dx,$D223=sx,$D223=up,$D223=down),(E223*J223)+H222))","v":{"v":0,"d":"0.00"}},{"$f":"IF(D222=Loop,$I$191,_xlfn.IFS($D223=Angle,(E223*K223)+I222,$D223=Loop,$I$190,OR($D223=\"\",$D223=End),I222,OR($D223=Dx,$D223=sx,$D223=up,$D223=down),(E223*K223)+I222))","v":{"v":0,"d":"0.00"}},{"$f":"+COS(RADIANS(F223))","v":{"v":1,"d":"1.0000"}},{"$f":"SIN(RADIANS(F223))","v":{"v":0,"d":"0.0000"}},{"v":0,"d":"0.00"},"","","","",{"$f":"+IF(OR(E223=0,E223=\"\"),0,IF(MOD(E223,$S$189),_xlfn.FLOOR.MATH(E223/$S$189),_xlfn.FLOOR.MATH(E223/$S$189)-1))","v":0},null,{"$f":"+IF(G223=0,0,IF(MOD(G223,SpanTow),_xlfn.FLOOR.MATH(G223/SpanTow),_xlfn.FLOOR.MATH(G223/SpanTow)-1))","v":0},0,{"v":0,"d":"0.00"},null,false,{"$f":"IF(OR(D223=Loop,D223=\"Fine\",AND(D223=\"\",D224=\"\")),FALSE,_xlfn.FORECAST.LINEAR(ProjSpan,FxDb,SpanDB))","v":false},false,false,false,false,false,null,null,{"v":0,"d":"0.00"},{"v":0,"d":"0.00"},0,0]
[null,{"$f":"_xlfn.IFS(C223=\"\",\"\",C223=\"\",\"\",AND(D224<>End,D223<>Loop),C223,D224=End,_xlfn.CONCAT(C223,\", \"&$F$11),D223=Loop,_xlfn.CONCAT($F$11&\" x2,1\"))","v":""},{"$f":"IF(OR(D68=End,D68=Loop),F68,C69)","v":""},"",{"$f":"IF(D223=Loop,$E$191,+I68)","v":{"v":0,"d":"0.00"}},{"$f":"IF(D223=Loop,$F$191,IF(OR(D224=End,D224=Loop,D224=\"\"),0,IF(D224<>Angle,VLOOKUP(D224,Angoli,2,FALSE),G68)))","v":0},{"$f":"IF(D223=Loop,$G$191,+IF(D224=Loop,SQRT((H224-H223)^2+(I224-I223)^2),0))","v":{"v":0,"d":"0.00"}},{"$f":"IF(D223=Loop,$H$191,_xlfn.IFS($D224=Angle,(E224*J224)+H223,$D224=Loop,$H$190,OR($D224=\"\",$D224=End),H223,OR($D224=Dx,$D224=sx,$D224=up,$D224=down),(E224*J224)+H223))","v":{"v":0,"d":"0.00"}},{"$f":"IF(D223=Loop,$I$191,_xlfn.IFS($D224=Angle,(E224*K224)+I223,$D224=Loop,$I$190,OR($D224=\"\",$D224=End),I223,OR($D224=Dx,$D224=sx,$D224=up,$D224=down),(E224*K224)+I223))","v":{"v":0,"d":"0.00"}},{"v":1,"d":"1.0000"},{"v":0,"d":"0.0000"},{"v":0,"d":"0.00"},{"$f":"IF(D224=Loop,ABS(180-ABS(F225-L224)),IF(D225=Loop,(ABS(180-(L225-F224))),IF(AND(H224=H225,I224=I225),\"\",ABS(180-ABS(F225-F224)))))","v":""},"","","",0,null,{"$f":"+IF(G224=0,0,IF(MOD(G224,SpanTow),_xlfn.FLOOR.MATH(G224/SpanTow),_xlfn.FLOOR.MATH(G224/SpanTow)-1))","v":0},0,{"v":0,"d":"0.00"},null,false,false,false,false,false,false,false,null,null,{"v":0,"d":"0.00"},{"v":0,"d":"0.00"},0,0]
[null,{"$f":"_xlfn.IFS(C224=\"\",\"\",C224=\"\",\"\",AND(D225<>End,D224<>Loop),C224,D225=End,_xlfn.CONCAT(C224,\", \"&$F$11),D224=Loop,_xlfn.CONCAT($F$11&\" x2,1\"))","v":""},"","",{"v":0,"d":"0.00"},0,{"v":0,"d":"0.00"},{"$f":"IF(D224=Loop,$H$191,_xlfn.IFS($D225=Angle,(E225*J225)+H224,$D225=Loop,$H$190,OR($D225=\"\",$D225=End),H224,OR($D225=Dx,$D225=sx,$D225=up,$D225=down),(E225*J225)+H224))","v":{"v":0,"d":"0.00"}},{"$f":"IF(D224=Loop,$I$191,_xlfn.IFS($D225=Angle,(E225*K225)+I224,$D225=Loop,$I$190,OR($D225=\"\",$D225=End),I224,OR($D225=Dx,$D225=sx,$D225=up,$D225=down),(E225*K225)+I224))","v":{"v":0,"d":"0.00"}},{"v":1,"d":"1.0000"},{"v":0,"d":"0.0000"},{"v":0,"d":"0.00"},"","","","",0,null,{"$f":"+IF(G225=0,0,IF(MOD(G225,SpanTow),_xlfn.FLOOR.MATH(G225/SpanTow),_xlfn.FLOOR.MATH(G225/SpanTow)-1))","v":0},0,{"v":0,"d":"0.00"},null,false,false,false,false,false,false,false,null,null,{"v":0,"d":"0.00"},{"v":0,"d":"0.00"},0,0]
[null,{"$f":"_xlfn.IFS(C225=\"\",\"\",C225=\"\",\"\",AND(D226<>End,D225<>Loop),C225,D226=End,_xlfn.CONCAT(C225,\", \"&$F$11),D225=Loop,_xlfn.CONCAT($F$11&\" x2,1\"))","v":""},"","",{"v":0,"d":"0.00"},0,{"v":0,"d":"0.00"},{"$f":"IF(D225=Loop,$H$191,_xlfn.IFS($D226=Angle,(E226*J226)+H225,$D226=Loop,$H$190,OR($D226=\"\",$D226=End),H225,OR($D226=Dx,$D226=sx,$D226=up,$D226=down),(E226*J226)+H225))","v":{"v":0,"d":"0.00"}},{"$f":"IF(D225=Loop,$I$191,_xlfn.IFS($D226=Angle,(E226*K226)+I225,$D226=Loop,$I$190,OR($D226=\"\",$D226=End),I225,OR($D226=Dx,$D226=sx,$D226=up,$D226=down),(E226*K226)+I225))","v":{"v":0,"d":"0.00"}},{"v":1,"d":"1.0000"},{"v":0,"d":"0.0000"},{"v":0,"d":"0.00"},"","","","",0,null,{"$f":"+IF(G226=0,0,IF(MOD(G226,SpanTow),_xlfn.FLOOR.MATH(G226/SpanTow),_xlfn.FLOOR.MATH(G226/SpanTow)-1))","v":0},0,{"v":0,"d":"0.00"},null,false,false,false,false,false,false,false,null,null,{"v":0,"d":"0.00"},{"v":0,"d":"0.00"},0,0]
[null,{"$f":"_xlfn.IFS(C226=\"\",\"\",C226=\"\",\"\",AND(D227<>End,D226<>Loop),C226,D227=End,_xlfn.CONCAT(C226,\", \"&$F$11),D226=Loop,_xlfn.CONCAT($F$11&\" x2,1\"))","v":""},"","",{"v":0,"d":"0.00"},0,{"v":0,"d":"0.00"},{"$f":"IF(D226=Loop,$H$191,_xlfn.IFS($D227=Angle,(E227*J227)+H226,$D227=Loop,$H$190,OR($D227=\"\",$D227=End),H226,OR($D227=Dx,$D227=sx,$D227=up,$D227=down),(E227*J227)+H226))","v":{"v":0,"d":"0.00"}},{"$f":"IF(D226=Loop,$I$191,_xlfn.IFS($D227=Angle,(E227*K227)+I226,$D227=Loop,$I$190,OR($D227=\"\",$D227=End),I226,OR($D227=Dx,$D227=sx,$D227=up,$D227=down),(E227*K227)+I226))","v":{"v":0,"d":"0.00"}},{"v":1,"d":"1.0000"},{"v":0,"d":"0.0000"},{"v":0,"d":"0.00"},"","","","",0,null,{"$f":"+IF(G227=0,0,IF(MOD(G227,SpanTow),_xlfn.FLOOR.MATH(G227/SpanTow),_xlfn.FLOOR.MATH(G227/SpanTow)-1))","v":0},0,{"v":0,"d":"0.00"},null,false,false,false,false,false,false,false,null,null,{"v":0,"d":"0.00"},{"v":0,"d":"0.00"},0,0]
[null,{"$f":"_xlfn.IFS(C227=\"\",\"\",C227=\"\",\"\",AND(D228<>End,D227<>Loop),C227,D228=End,_xlfn.CONCAT(C227,\", \"&$F$11),D227=Loop,_xlfn.CONCAT($F$11&\" x2,1\"))","v":""},"","",{"v":0,"d":"0.00"},0,{"v":0,"d":"0.00"},{"$f":"IF(D227=Loop,$H$191,_xlfn.IFS($D228=Angle,(E228*J228)+H227,$D228=Loop,$H$190,OR($D228=\"\",$D228=End),H227,OR($D228=Dx,$D228=sx,$D228=up,$D228=down),(E228*J228)+H227))","v":{"v":0,"d":"0.00"}},{"$f":"IF(D227=Loop,$I$191,_xlfn.IFS($D228=Angle,(E228*K228)+I227,$D228=Loop,$I$190,OR($D228=\"\",$D228=End),I227,OR($D228=Dx,$D228=sx,$D228=up,$D228=down),(E228*K228)+I227))","v":{"v":0,"d":"0.00"}},{"v":1,"d":"1.0000"},{"v":0,"d":"0.0000"},{"v":0,"d":"0.00"},"","","","",0,null,{"$f":"+IF(G228=0,0,IF(MOD(G228,SpanTow),_xlfn.FLOOR.MATH(G228/SpanTow),_xlfn.FLOOR.MATH(G228/SpanTow)-1))","v":0},0,{"v":0,"d":"0.00"},null,false,false,false,false,false,false,false,null,null,{"v":0,"d":"0.00"},{"v":0,"d":"0.00"},0,0]
[null,{"$f":"_xlfn.IFS(C228=\"\",\"\",C228=\"\",\"\",AND(D229<>End,D228<>Loop),C228,D229=End,_xlfn.CONCAT(C228,\", \"&$F$11),D228=Loop,_xlfn.CONCAT($F$11&\" x2,1\"))","v":""},"","",{"v":0,"d":"0.00"},0,{"v":0,"d":"0.00"},{"$f":"IF(D228=Loop,$H$191,_xlfn.IFS($D229=Angle,(E229*J229)+H228,$D229=Loop,$H$190,OR($D229=\"\",$D229=End),H228,OR($D229=Dx,$D229=sx,$D229=up,$D229=down),(E229*J229)+H228))","v":{"v":0,"d":"0.00"}},{"$f":"IF(D228=Loop,$I$191,_xlfn.IFS($D229=Angle,(E229*K229)+I228,$D229=Loop,$I$190,OR($D229=\"\",$D229=End),I228,OR($D229=Dx,$D229=sx,$D229=up,$D229=down),(E229*K229)+I228))","v":{"v":0,"d":"0.00"}},{"v":1,"d":"1.0000"},{"v":0,"d":"0.0000"},{"v":0,"d":"0.00"},"","","","",0,null,{"$f":"+IF(G229=0,0,IF(MOD(G229,SpanTow),_xlfn.FLOOR.MATH(G229/SpanTow),_xlfn.FLOOR.MATH(G229/SpanTow)-1))","v":0},0,{"v":0,"d":"0.00"},null,false,false,false,false,false,false,false,null,null,{"v":0,"d":"0.00"},{"v":0,"d":"0.00"},0,0]
[null,{"$f":"_xlfn.IFS(C229=\"\",\"\",C229=\"\",\"\",AND(D230<>End,D229<>Loop),C229,D230=End,_xlfn.CONCAT(C229,\", \"&$F$11),D229=Loop,_xlfn.CONCAT($F$11&\" x2,1\"))","v":""},"","",{"v":0,"d":"0.00"},0,{"v":0,"d":"0.00"},{"$f":"IF(D229=Loop,$H$191,_xlfn.IFS($D230=Angle,(E230*J230)+H229,$D230=Loop,$H$190,OR($D230=\"\",$D230=End),H229,OR($D230=Dx,$D230=sx,$D230=up,$D230=down),(E230*J230)+H229))","v":{"v":0,"d":"0.00"}},{"$f":"IF(D229=Loop,$I$191,_xlfn.IFS($D230=Angle,(E230*K230)+I229,$D230=Loop,$I$190,OR($D230=\"\",$D230=End),I229,OR($D230=Dx,$D230=sx,$D230=up,$D230=down),(E230*K230)+I229))","v":{"v":0,"d":"0.00"}},{"v":1,"d":"1.0000"},{"v":0,"d":"0.0000"},{"v":0,"d":"0.00"},"","","","",0,null,{"$f":"+IF(G230=0,0,IF(MOD(G230,SpanTow),_xlfn.FLOOR.MATH(G230/SpanTow),_xlfn.FLOOR.MATH(G230/SpanTow)-1))","v":0},0,{"v":0,"d":"0.00"},null,false,false,false,false,false,false,false,null,null,{"v":0,"d":"0.00"},{"v":0,"d":"0.00"},0,0]
[null,{"$f":"_xlfn.IFS(C230=\"\",\"\",C230=\"\",\"\",AND(D231<>End,D230<>Loop),C230,D231=End,_xlfn.CONCAT(C230,\", \"&$F$11),D230=Loop,_xlfn.CONCAT($F$11&\" x2,1\"))","v":""},"","",{"v":0,"d":"0.00"},0,{"v":0,"d":"0.00"},{"$f":"IF(D230=Loop,$H$191,_xlfn.IFS($D231=Angle,(E231*J231)+H230,$D231=Loop,$H$190,OR($D231=\"\",$D231=End),H230,OR($D231=Dx,$D231=sx,$D231=up,$D231=down),(E231*J231)+H230))","v":{"v":0,"d":"0.00"}},{"$f":"IF(D230=Loop,$I$191,_xlfn.IFS($D231=Angle,(E231*K231)+I230,$D231=Loop,$I$190,OR($D231=\"\",$D231=End),I230,OR($D231=Dx,$D231=sx,$D231=up,$D231=down),(E231*K231)+I230))","v":{"v":0,"d":"0.00"}},{"v":1,"d":"1.0000"},{"v":0,"d":"0.0000"},{"v":0,"d":"0.00"},"","","","",0,null,{"$f":"+IF(G231=0,0,IF(MOD(G231,SpanTow),_xlfn.FLOOR.MATH(G231/SpanTow),_xlfn.FLOOR.MATH(G231/SpanTow)-1))","v":0},0,{"v":0,"d":"0.00"},null,false,false,false,false,false,false,false,null,null,{"v":0,"d":"0.00"},{"v":0,"d":"0.00"},0,0]
[null,{"$f":"_xlfn.IFS(C231=\"\",\"\",C231=\"\",\"\",AND(D232<>End,D231<>Loop),C231,D232=End,_xlfn.CONCAT(C231,\", \"&$F$11),D231=Loop,_xlfn.CONCAT($F$11&\" x2,1\"))","v":""},"","",{"v":0,"d":"0.00"},0,{"v":0,"d":"0.00"},{"$f":"IF(D231=Loop,$H$191,_xlfn.IFS($D232=Angle,(E232*J232)+H231,$D232=Loop,$H$190,OR($D232=\"\",$D232=End),H231,OR($D232=Dx,$D232=sx,$D232=up,$D232=down),(E232*J232)+H231))","v":{"v":0,"d":"0.00"}},{"$f":"IF(D231=Loop,$I$191,_xlfn.IFS($D232=Angle,(E232*K232)+I231,$D232=Loop,$I$190,OR($D232=\"\",$D232=End),I231,OR($D232=Dx,$D232=sx,$D232=up,$D232=down),(E232*K232)+I231))","v":{"v":0,"d":"0.00"}},{"v":1,"d":"1.0000"},{"v":0,"d":"0.0000"},{"v":0,"d":"0.00"},"","","","",0,null,{"$f":"+IF(G232=0,0,IF(MOD(G232,SpanTow),_xlfn.FLOOR.MATH(G232/SpanTow),_xlfn.FLOOR.MATH(G232/SpanTow)-1))","v":0},0,{"v":0,"d":"0.00"},null,false,false,false,false,false,false,false,null,null,{"v":0,"d":"0.00"},{"v":0,"d":"0.00"},0,0]
[null,{"$f":"_xlfn.IFS(C232=\"\",\"\",C232=\"\",\"\",AND(D233<>End,D232<>Loop),C232,D233=End,_xlfn.CONCAT(C232,\", \"&$F$11),D232=Loop,_xlfn.CONCAT($F$11&\" x2,1\"))","v":""},"","",{"v":0,"d":"0.00"},0,{"v":0,"d":"0.00"},{"$f":"IF(D232=Loop,$H$191,_xlfn.IFS($D233=Angle,(E233*J233)+H232,$D233=Loop,$H$190,OR($D233=\"\",$D233=End),H232,OR($D233=Dx,$D233=sx,$D233=up,$D233=down),(E233*J233)+H232))","v":{"v":0,"d":"0.00"}},{"$f":"IF(D232=Loop,$I$191,_xlfn.IFS($D233=Angle,(E233*K233)+I232,$D233=Loop,$I$190,OR($D233=\"\",$D233=End),I232,OR($D233=Dx,$D233=sx,$D233=up,$D233=down),(E233*K233)+I232))","v":{"v":0,"d":"0.00"}},{"v":1,"d":"1.0000"},{"v":0,"d":"0.0000"},{"v":0,"d":"0.00"},"","","","",0,null,{"$f":"+IF(G233=0,0,IF(MOD(G233,SpanTow),_xlfn.FLOOR.MATH(G233/SpanTow),_xlfn.FLOOR.MATH(G233/SpanTow)-1))","v":0},0,{"v":0,"d":"0.00"},null,false,false,false,false,false,false,false,null,null,{"v":0,"d":"0.00"},{"v":0,"d":"0.00"},0,0]
[null,{"$f":"_xlfn.IFS(C233=\"\",\"\",C233=\"\",\"\",AND(D234<>End,D233<>Loop),C233,D234=End,_xlfn.CONCAT(C233,\", \"&$F$11),D233=Loop,_xlfn.CONCAT($F$11&\" x2,1\"))","v":""},"","",{"v":0,"d":"0.00"},0,{"v":0,"d":"0.00"},{"$f":"IF(D233=Loop,$H$191,_xlfn.IFS($D234=Angle,(E234*J234)+H233,$D234=Loop,$H$190,OR($D234=\"\",$D234=End),H233,OR($D234=Dx,$D234=sx,$D234=up,$D234=down),(E234*J234)+H233))","v":{"v":0,"d":"0.00"}},{"$f":"IF(D233=Loop,$I$191,_xlfn.IFS($D234=Angle,(E234*K234)+I233,$D234=Loop,$I$190,OR($D234=\"\",$D234=End),I233,OR($D234=Dx,$D234=sx,$D234=up,$D234=down),(E234*K234)+I233))","v":{"v":0,"d":"0.00"}},{"v":1,"d":"1.0000"},{"v":0,"d":"0.0000"},{"v":0,"d":"0.00"},"","","","",0,null,{"$f":"+IF(G234=0,0,IF(MOD(G234,SpanTow),_xlfn.FLOOR.MATH(G234/SpanTow),_xlfn.FLOOR.MATH(G234/SpanTow)-1))","v":0},0,{"v":0,"d":"0.00"},null,false,false,false,false,false,false,false,null,null,{"v":0,"d":"0.00"},{"v":0,"d":"0.00"},0,0]
[null,{"$f":"_xlfn.IFS(C234=\"\",\"\",C234=\"\",\"\",AND(D235<>End,D234<>Loop),C234,D235=End,_xlfn.CONCAT(C234,\", \"&$F$11),D234=Loop,_xlfn.CONCAT($F$11&\" x2,1\"))","v":""},"","",{"v":0,"d":"0.00"},0,{"v":0,"d":"0.00"},{"$f":"IF(D234=Loop,$H$191,_xlfn.IFS($D235=Angle,(E235*J235)+H234,$D235=Loop,$H$190,OR($D235=\"\",$D235=End),H234,OR($D235=Dx,$D235=sx,$D235=up,$D235=down),(E235*J235)+H234))","v":{"v":0,"d":"0.00"}},{"$f":"IF(D234=Loop,$I$191,_xlfn.IFS($D235=Angle,(E235*K235)+I234,$D235=Loop,$I$190,OR($D235=\"\",$D235=End),I234,OR($D235=Dx,$D235=sx,$D235=up,$D235=down),(E235*K235)+I234))","v":{"v":0,"d":"0.00"}},{"v":1,"d":"1.0000"},{"v":0,"d":"0.0000"},{"v":0,"d":"0.00"},"","","","",0,null,{"$f":"+IF(G235=0,0,IF(MOD(G235,SpanTow),_xlfn.FLOOR.MATH(G235/SpanTow),_xlfn.FLOOR.MATH(G235/SpanTow)-1))","v":0},0,{"v":0,"d":"0.00"},null,false,false,false,false,false,false,false,null,null,{"v":0,"d":"0.00"},{"v":0,"d":"0.00"},0,0]
[null,{"$f":"_xlfn.IFS(C235=\"\",\"\",C235=\"\",\"\",AND(D236<>End,D235<>Loop),C235,D236=End,_xlfn.CONCAT(C235,\", \"&$F$11),D235=Loop,_xlfn.CONCAT($F$11&\" x2,1\"))","v":""},"","",{"v":0,"d":"0.00"},0,{"v":0,"d":"0.00"},{"$f":"IF(D235=Loop,$H$191,_xlfn.IFS($D236=Angle,(E236*J236)+H235,$D236=Loop,$H$190,OR($D236=\"\",$D236=End),H235,OR($D236=Dx,$D236=sx,$D236=up,$D236=down),(E236*J236)+H235))","v":{"v":0,"d":"0.00"}},{"$f":"IF(D235=Loop,$I$191,_xlfn.IFS($D236=Angle,(E236*K236)+I235,$D236=Loop,$I$190,OR($D236=\"\",$D236=End),I235,OR($D236=Dx,$D236=sx,$D236=up,$D236=down),(E236*K236)+I235))","v":{"v":0,"d":"0.00"}},{"v":1,"d":"1.0000"},{"v":0,"d":"0.0000"},{"v":0,"d":"0.00"},"","","","",0,null,{"$f":"+IF(G236=0,0,IF(MOD(G236,SpanTow),_xlfn.FLOOR.MATH(G236/SpanTow),_xlfn.FLOOR.MATH(G236/SpanTow)-1))","v":0},0,{"v":0,"d":"0.00"},null,false,false,false,false,false,false,false,null,null,{"v":0,"d":"0.00"},{"v":0,"d":"0.00"},0,0]
[null,{"$f":"_xlfn.IFS(C236=\"\",\"\",C236=\"\",\"\",AND(D237<>End,D236<>Loop),C236,D237=End,_xlfn.CONCAT(C236,\", \"&$F$11),D236=Loop,_xlfn.CONCAT($F$11&\" x2,1\"))","v":""},"","",{"v":0,"d":"0.00"},0,{"v":0,"d":"0.00"},{"$f":"IF(D236=Loop,$H$191,_xlfn.IFS($D237=Angle,(E237*J237)+H236,$D237=Loop,$H$190,OR($D237=\"\",$D237=End),H236,OR($D237=Dx,$D237=sx,$D237=up,$D237=down),(E237*J237)+H236))","v":{"v":0,"d":"0.00"}},{"$f":"IF(D236=Loop,$I$191,_xlfn.IFS($D237=Angle,(E237*K237)+I236,$D237=Loop,$I$190,OR($D237=\"\",$D237=End),I236,OR($D237=Dx,$D237=sx,$D237=up,$D237=down),(E237*K237)+I236))","v":{"v":0,"d":"0.00"}},{"v":1,"d":"1.0000"},{"v":0,"d":"0.0000"},{"v":0,"d":"0.00"},"","","","",0,null,{"$f":"+IF(G237=0,0,IF(MOD(G237,SpanTow),_xlfn.FLOOR.MATH(G237/SpanTow),_xlfn.FLOOR.MATH(G237/SpanTow)-1))","v":0},0,{"v":0,"d":"0.00"},null,false,false,false,false,false,false,false,null,null,{"v":0,"d":"0.00"},{"v":0,"d":"0.00"},0,0]
[null,{"$f":"_xlfn.IFS(C237=\"\",\"\",C237=\"\",\"\",AND(D238<>End,D237<>Loop),C237,D238=End,_xlfn.CONCAT(C237,\", \"&$F$11),D237=Loop,_xlfn.CONCAT($F$11&\" x2,1\"))","v":""},"","",{"v":0,"d":"0.00"},0,{"v":0,"d":"0.00"},{"$f":"IF(D237=Loop,$H$191,_xlfn.IFS($D238=Angle,(E238*J238)+H237,$D238=Loop,$H$190,OR($D238=\"\",$D238=End),H237,OR($D238=Dx,$D238=sx,$D238=up,$D238=down),(E238*J238)+H237))","v":{"v":0,"d":"0.00"}},{"$f":"IF(D237=Loop,$I$191,_xlfn.IFS($D238=Angle,(E238*K238)+I237,$D238=Loop,$I$190,OR($D238=\"\",$D238=End),I237,OR($D238=Dx,$D238=sx,$D238=up,$D238=down),(E238*K238)+I237))","v":{"v":0,"d":"0.00"}},{"v":1,"d":"1.0000"},{"v":0,"d":"0.0000"},{"v":0,"d":"0.00"},"","","","",0,null,{"$f":"+IF(G238=0,0,IF(MOD(G238,SpanTow),_xlfn.FLOOR.MATH(G238/SpanTow),_xlfn.FLOOR.MATH(G238/SpanTow)-1))","v":0},0,{"v":0,"d":"0.00"},null,false,false,false,false,false,false,false,null,null,{"v":0,"d":"0.00"},{"v":0,"d":"0.00"},0,0]
[null,{"$f":"_xlfn.IFS(C238=\"\",\"\",C238=\"\",\"\",AND(D239<>End,D238<>Loop),C238,D239=End,_xlfn.CONCAT(C238,\", \"&$F$11),D238=Loop,_xlfn.CONCAT($F$11&\" x2,1\"))","v":""},"","",{"v":0,"d":"0.00"},0,{"v":0,"d":"0.00"},{"$f":"IF(D238=Loop,$H$191,_xlfn.IFS($D239=Angle,(E239*J239)+H238,$D239=Loop,$H$190,OR($D239=\"\",$D239=End),H238,OR($D239=Dx,$D239=sx,$D239=up,$D239=down),(E239*J239)+H238))","v":{"v":0,"d":"0.00"}},{"$f":"IF(D238=Loop,$I$191,_xlfn.IFS($D239=Angle,(E239*K239)+I238,$D239=Loop,$I$190,OR($D239=\"\",$D239=End),I238,OR($D239=Dx,$D239=sx,$D239=up,$D239=down),(E239*K239)+I238))","v":{"v":0,"d":"0.00"}},{"v":1,"d":"1.0000"},{"v":0,"d":"0.0000"},{"v":0,"d":"0.00"},"","","","",0,null,{"$f":"+IF(G239=0,0,IF(MOD(G239,SpanTow),_xlfn.FLOOR.MATH(G239/SpanTow),_xlfn.FLOOR.MATH(G239/SpanTow)-1))","v":0},0,{"v":0,"d":"0.00"},null,false,false,false,false,false,false,false,null,null,{"v":0,"d":"0.00"},{"v":0,"d":"0.00"},0,0]
[null,{"$f":"_xlfn.IFS(C239=\"\",\"\",C239=\"\",\"\",AND(D240<>End,D239<>Loop),C239,D240=End,_xlfn.CONCAT(C239,\", \"&$F$11),D239=Loop,_xlfn.CONCAT($F$11&\" x2,1\"))","v":""},"","",{"v":0,"d":"0.00"},0,{"v":0,"d":"0.00"},{"$f":"IF(D239=Loop,$H$191,_xlfn.IFS($D240=Angle,(E240*J240)+H239,$D240=Loop,$H$190,OR($D240=\"\",$D240=End),H239,OR($D240=Dx,$D240=sx,$D240=up,$D240=down),(E240*J240)+H239))","v":{"v":0,"d":"0.00"}},{"$f":"IF(D239=Loop,$I$191,_xlfn.IFS($D240=Angle,(E240*K240)+I239,$D240=Loop,$I$190,OR($D240=\"\",$D240=End),I239,OR($D240=Dx,$D240=sx,$D240=up,$D240=down),(E240*K240)+I239))","v":{"v":0,"d":"0.00"}},{"v":1,"d":"1.0000"},{"v":0,"d":"0.0000"},{"v":0,"d":"0.00"},"","","","",0,null,{"$f":"+IF(G240=0,0,IF(MOD(G240,SpanTow),_xlfn.FLOOR.MATH(G240/SpanTow),_xlfn.FLOOR.MATH(G240/SpanTow)-1))","v":0},0,{"v":0,"d":"0.00"},null,false,false,false,false,false,false,false,null,null,{"v":0,"d":"0.00"},{"v":0,"d":"0.00"},0,0]
[null,{"$f":"_xlfn.IFS(C240=\"\",\"\",C240=\"\",\"\",AND(D241<>End,D240<>Loop),C240,D241=End,_xlfn.CONCAT(C240,\", \"&$F$11),D240=Loop,_xlfn.CONCAT($F$11&\" x2,1\"))","v":""},"","",{"v":0,"d":"0.00"},0,{"v":0,"d":"0.00"},{"$f":"IF(D240=Loop,$H$191,_xlfn.IFS($D241=Angle,(E241*J241)+H240,$D241=Loop,$H$190,OR($D241=\"\",$D241=End),H240,OR($D241=Dx,$D241=sx,$D241=up,$D241=down),(E241*J241)+H240))","v":{"v":0,"d":"0.00"}},{"$f":"IF(D240=Loop,$I$191,_xlfn.IFS($D241=Angle,(E241*K241)+I240,$D241=Loop,$I$190,OR($D241=\"\",$D241=End),I240,OR($D241=Dx,$D241=sx,$D241=up,$D241=down),(E241*K241)+I240))","v":{"v":0,"d":"0.00"}},{"v":1,"d":"1.0000"},{"v":0,"d":"0.0000"},{"v":0,"d":"0.00"},"","","","",0,null,{"$f":"+IF(G241=0,0,IF(MOD(G241,SpanTow),_xlfn.FLOOR.MATH(G241/SpanTow),_xlfn.FLOOR.MATH(G241/SpanTow)-1))","v":0},0,{"v":0,"d":"0.00"},null,false,false,false,false,false,false,false,null,null,{"v":0,"d":"0.00"},{"v":0,"d":"0.00"},0,0]
[null,{"$f":"_xlfn.IFS(C241=\"\",\"\",C241=\"\",\"\",AND(D242<>End,D241<>Loop),C241,D242=End,_xlfn.CONCAT(C241,\", \"&$F$11),D241=Loop,_xlfn.CONCAT($F$11&\" x2,1\"))","v":""},"","",{"v":0,"d":"0.00"},0,{"v":0,"d":"0.00"},{"$f":"IF(D241=Loop,$H$191,_xlfn.IFS($D242=Angle,(E242*J242)+H241,$D242=Loop,$H$190,OR($D242=\"\",$D242=End),H241,OR($D242=Dx,$D242=sx,$D242=up,$D242=down),(E242*J242)+H241))","v":{"v":0,"d":"0.00"}},{"$f":"IF(D241=Loop,$I$191,_xlfn.IFS($D242=Angle,(E242*K242)+I241,$D242=Loop,$I$190,OR($D242=\"\",$D242=End),I241,OR($D242=Dx,$D242=sx,$D242=up,$D242=down),(E242*K242)+I241))","v":{"v":0,"d":"0.00"}},{"v":1,"d":"1.0000"},{"v":0,"d":"0.0000"},{"v":0,"d":"0.00"},"","","","",0,null,{"$f":"+IF(G242=0,0,IF(MOD(G242,SpanTow),_xlfn.FLOOR.MATH(G242/SpanTow),_xlfn.FLOOR.MATH(G242/SpanTow)-1))","v":0},0,{"v":0,"d":"0.00"},null,false,false,false,false,false,false,false,null,null,{"v":0,"d":"0.00"},{"v":0,"d":"0.00"},0,0]
[null,{"$f":"_xlfn.IFS(C242=\"\",\"\",C242=\"\",\"\",AND(D243<>End,D242<>Loop),C242,D243=End,_xlfn.CONCAT(C242,\", \"&$F$11),D242=Loop,_xlfn.CONCAT($F$11&\" x2,1\"))","v":""},"","",{"v":0,"d":"0.00"},0,{"v":0,"d":"0.00"},{"$f":"IF(D242=Loop,$H$191,_xlfn.IFS($D243=Angle,(E243*J243)+H242,$D243=Loop,$H$190,OR($D243=\"\",$D243=End),H242,OR($D243=Dx,$D243=sx,$D243=up,$D243=down),(E243*J243)+H242))","v":{"v":0,"d":"0.00"}},{"$f":"IF(D242=Loop,$I$191,_xlfn.IFS($D243=Angle,(E243*K243)+I242,$D243=Loop,$I$190,OR($D243=\"\",$D243=End),I242,OR($D243=Dx,$D243=sx,$D243=up,$D243=down),(E243*K243)+I242))","v":{"v":0,"d":"0.00"}},{"v":1,"d":"1.0000"},{"v":0,"d":"0.0000"},{"v":0,"d":"0.00"},"","","","",0,null,{"$f":"+IF(G243=0,0,IF(MOD(G243,SpanTow),_xlfn.FLOOR.MATH(G243/SpanTow),_xlfn.FLOOR.MATH(G243/SpanTow)-1))","v":0},0,{"v":0,"d":"0.00"},null,false,false,false,false,false,false,false,null,null,{"v":0,"d":"0.00"},{"v":0,"d":"0.00"},0,0]
[null,{"$f":"_xlfn.IFS(C243=\"\",\"\",C243=\"\",\"\",AND(D244<>End,D243<>Loop),C243,D244=End,_xlfn.CONCAT(C243,\", \"&$F$11),D243=Loop,_xlfn.CONCAT($F$11&\" x2,1\"))","v":""},"","",{"v":0,"d":"0.00"},0,{"v":0,"d":"0.00"},{"$f":"IF(D243=Loop,$H$191,_xlfn.IFS($D244=Angle,(E244*J244)+H243,$D244=Loop,$H$190,OR($D244=\"\",$D244=End),H243,OR($D244=Dx,$D244=sx,$D244=up,$D244=down),(E244*J244)+H243))","v":{"v":0,"d":"0.00"}},{"$f":"IF(D243=Loop,$I$191,_xlfn.IFS($D244=Angle,(E244*K244)+I243,$D244=Loop,$I$190,OR($D244=\"\",$D244=End),I243,OR($D244=Dx,$D244=sx,$D244=up,$D244=down),(E244*K244)+I243))","v":{"v":0,"d":"0.00"}},{"v":1,"d":"1.0000"},{"v":0,"d":"0.0000"},{"v":0,"d":"0.00"},"","","","",0,null,{"$f":"+IF(G244=0,0,IF(MOD(G244,SpanTow),_xlfn.FLOOR.MATH(G244/SpanTow),_xlfn.FLOOR.MATH(G244/SpanTow)-1))","v":0},0,{"v":0,"d":"0.00"},null,false,false,false,false,false,false,false,null,null,{"v":0,"d":"0.00"},{"v":0,"d":"0.00"},0,0]
[null,{"$f":"_xlfn.IFS(C244=\"\",\"\",C244=\"\",\"\",AND(D245<>End,D244<>Loop),C244,D245=End,_xlfn.CONCAT(C244,\", \"&$F$11),D244=Loop,_xlfn.CONCAT($F$11&\" x2,1\"))","v":""},"","",{"v":0,"d":"0.00"},0,{"v":0,"d":"0.00"},{"$f":"IF(D244=Loop,$H$191,_xlfn.IFS($D245=Angle,(E245*J245)+H244,$D245=Loop,$H$190,OR($D245=\"\",$D245=End),H244,OR($D245=Dx,$D245=sx,$D245=up,$D245=down),(E245*J245)+H244))","v":{"v":0,"d":"0.00"}},{"$f":"IF(D244=Loop,$I$191,_xlfn.IFS($D245=Angle,(E245*K245)+I244,$D245=Loop,$I$190,OR($D245=\"\",$D245=End),I244,OR($D245=Dx,$D245=sx,$D245=up,$D245=down),(E245*K245)+I244))","v":{"v":0,"d":"0.00"}},{"v":1,"d":"1.0000"},{"v":0,"d":"0.0000"},{"v":0,"d":"0.00"},"","","","",0,null,{"$f":"+IF(G245=0,0,IF(MOD(G245,SpanTow),_xlfn.FLOOR.MATH(G245/SpanTow),_xlfn.FLOOR.MATH(G245/SpanTow)-1))","v":0},0,{"v":0,"d":"0.00"},null,false,false,false,false,false,false,false,null,null,{"v":0,"d":"0.00"},{"v":0,"d":"0.00"},0,0]
[null,{"$f":"_xlfn.IFS(C245=\"\",\"\",C245=\"\",\"\",AND(D246<>End,D245<>Loop),C245,D246=End,_xlfn.CONCAT(C245,\", \"&$F$11),D245=Loop,_xlfn.CONCAT($F$11&\" x2,1\"))","v":""},"","",{"v":0,"d":"0.00"},0,{"v":0,"d":"0.00"},{"$f":"IF(D245=Loop,$H$191,_xlfn.IFS($D246=Angle,(E246*J246)+H245,$D246=Loop,$H$190,OR($D246=\"\",$D246=End),H245,OR($D246=Dx,$D246=sx,$D246=up,$D246=down),(E246*J246)+H245))","v":{"v":0,"d":"0.00"}},{"$f":"IF(D245=Loop,$I$191,_xlfn.IFS($D246=Angle,(E246*K246)+I245,$D246=Loop,$I$190,OR($D246=\"\",$D246=End),I245,OR($D246=Dx,$D246=sx,$D246=up,$D246=down),(E246*K246)+I245))","v":{"v":0,"d":"0.00"}},{"v":1,"d":"1.0000"},{"v":0,"d":"0.0000"},{"v":0,"d":"0.00"},"","","","",0,null,{"$f":"+IF(G246=0,0,IF(MOD(G246,SpanTow),_xlfn.FLOOR.MATH(G246/SpanTow),_xlfn.FLOOR.MATH(G246/SpanTow)-1))","v":0},0,{"v":0,"d":"0.00"},null,false,false,false,false,false,false,false,null,null,{"v":0,"d":"0.00"},{"v":0,"d":"0.00"},0,0]
[null,{"$f":"_xlfn.IFS(C246=\"\",\"\",C246=\"\",\"\",AND(D247<>End,D246<>Loop),C246,D247=End,_xlfn.CONCAT(C246,\", \"&$F$11),D246=Loop,_xlfn.CONCAT($F$11&\" x2,1\"))","v":""},"","",{"v":0,"d":"0.00"},0,{"v":0,"d":"0.00"},{"$f":"IF(D246=Loop,$H$191,_xlfn.IFS($D247=Angle,(E247*J247)+H246,$D247=Loop,$H$190,OR($D247=\"\",$D247=End),H246,OR($D247=Dx,$D247=sx,$D247=up,$D247=down),(E247*J247)+H246))","v":{"v":0,"d":"0.00"}},{"$f":"IF(D246=Loop,$I$191,_xlfn.IFS($D247=Angle,(E247*K247)+I246,$D247=Loop,$I$190,OR($D247=\"\",$D247=End),I246,OR($D247=Dx,$D247=sx,$D247=up,$D247=down),(E247*K247)+I246))","v":{"v":0,"d":"0.00"}},{"v":1,"d":"1.0000"},{"v":0,"d":"0.0000"},{"v":0,"d":"0.00"},"","","","",0,null,{"$f":"+IF(G247=0,0,IF(MOD(G247,SpanTow),_xlfn.FLOOR.MATH(G247/SpanTow),_xlfn.FLOOR.MATH(G247/SpanTow)-1))","v":0},0,{"v":0,"d":"0.00"},null,false,false,false,false,false,false,false,null,null,{"v":0,"d":"0.00"},{"v":0,"d":"0.00"},0,0]
[null,{"$f":"_xlfn.IFS(C247=\"\",\"\",C247=\"\",\"\",AND(D248<>End,D247<>Loop),C247,D248=End,_xlfn.CONCAT(C247,\", \"&$F$11),D247=Loop,_xlfn.CONCAT($F$11&\" x2,1\"))","v":""},"","",{"v":0,"d":"0.00"},0,{"v":0,"d":"0.00"},{"$f":"IF(D247=Loop,$H$191,_xlfn.IFS($D248=Angle,(E248*J248)+H247,$D248=Loop,$H$190,OR($D248=\"\",$D248=End),H247,OR($D248=Dx,$D248=sx,$D248=up,$D248=down),(E248*J248)+H247))","v":{"v":0,"d":"0.00"}},{"$f":"IF(D247=Loop,$I$191,_xlfn.IFS($D248=Angle,(E248*K248)+I247,$D248=Loop,$I$190,OR($D248=\"\",$D248=End),I247,OR($D248=Dx,$D248=sx,$D248=up,$D248=down),(E248*K248)+I247))","v":{"v":0,"d":"0.00"}},{"v":1,"d":"1.0000"},{"v":0,"d":"0.0000"},{"v":0,"d":"0.00"},"","","","",0,null,{"$f":"+IF(G248=0,0,IF(MOD(G248,SpanTow),_xlfn.FLOOR.MATH(G248/SpanTow),_xlfn.FLOOR.MATH(G248/SpanTow)-1))","v":0},0,{"v":0,"d":"0.00"},null,false,false,false,false,false,false,false,null,null,{"v":0,"d":"0.00"},{"v":0,"d":"0.00"},0,0]
[null,{"$f":"_xlfn.IFS(C248=\"\",\"\",C248=\"\",\"\",AND(D249<>End,D248<>Loop),C248,D249=End,_xlfn.CONCAT(C248,\", \"&$F$11),D248=Loop,_xlfn.CONCAT($F$11&\" x2,1\"))","v":""},"","",{"v":0,"d":"0.00"},0,{"v":0,"d":"0.00"},{"$f":"IF(D248=Loop,$H$191,_xlfn.IFS($D249=Angle,(E249*J249)+H248,$D249=Loop,$H$190,OR($D249=\"\",$D249=End),H248,OR($D249=Dx,$D249=sx,$D249=up,$D249=down),(E249*J249)+H248))","v":{"v":0,"d":"0.00"}},{"$f":"IF(D248=Loop,$I$191,_xlfn.IFS($D249=Angle,(E249*K249)+I248,$D249=Loop,$I$190,OR($D249=\"\",$D249=End),I248,OR($D249=Dx,$D249=sx,$D249=up,$D249=down),(E249*K249)+I248))","v":{"v":0,"d":"0.00"}},{"v":1,"d":"1.0000"},{"v":0,"d":"0.0000"},{"v":0,"d":"0.00"},"","","","",0,null,{"$f":"+IF(G249=0,0,IF(MOD(G249,SpanTow),_xlfn.FLOOR.MATH(G249/SpanTow),_xlfn.FLOOR.MATH(G249/SpanTow)-1))","v":0},0,{"v":0,"d":"0.00"},null,false,false,false,false,false,false,false,null,null,{"v":0,"d":"0.00"},{"v":0,"d":"0.00"},0,0]
[null,{"$f":"_xlfn.IFS(C249=\"\",\"\",C249=\"\",\"\",AND(D250<>End,D249<>Loop),C249,D250=End,_xlfn.CONCAT(C249,\", \"&$F$11),D249=Loop,_xlfn.CONCAT($F$11&\" x2,1\"))","v":""},"","",{"v":0,"d":"0.00"},0,{"v":0,"d":"0.00"},{"$f":"IF(D249=Loop,$H$191,_xlfn.IFS($D250=Angle,(E250*J250)+H249,$D250=Loop,$H$190,OR($D250=\"\",$D250=End),H249,OR($D250=Dx,$D250=sx,$D250=up,$D250=down),(E250*J250)+H249))","v":{"v":0,"d":"0.00"}},{"$f":"IF(D249=Loop,$I$191,_xlfn.IFS($D250=Angle,(E250*K250)+I249,$D250=Loop,$I$190,OR($D250=\"\",$D250=End),I249,OR($D250=Dx,$D250=sx,$D250=up,$D250=down),(E250*K250)+I249))","v":{"v":0,"d":"0.00"}},{"v":1,"d":"1.0000"},{"v":0,"d":"0.0000"},{"v":0,"d":"0.00"},"","","","",0,null,{"$f":"+IF(G250=0,0,IF(MOD(G250,SpanTow),_xlfn.FLOOR.MATH(G250/SpanTow),_xlfn.FLOOR.MATH(G250/SpanTow)-1))","v":0},0,{"v":0,"d":"0.00"},null,false,false,false,false,false,false,false,null,null,{"v":0,"d":"0.00"},{"v":0,"d":"0.00"},0,0]
[null,{"$f":"_xlfn.IFS(C250=\"\",\"\",C250=\"\",\"\",AND(D251<>End,D250<>Loop),C250,D251=End,_xlfn.CONCAT(C250,\", \"&$F$11),D250=Loop,_xlfn.CONCAT($F$11&\" x2,1\"))","v":""},"","",{"v":0,"d":"0.00"},0,{"v":0,"d":"0.00"},{"$f":"IF(D250=Loop,$H$191,_xlfn.IFS($D251=Angle,(E251*J251)+H250,$D251=Loop,$H$190,OR($D251=\"\",$D251=End),H250,OR($D251=Dx,$D251=sx,$D251=up,$D251=down),(E251*J251)+H250))","v":{"v":0,"d":"0.00"}},{"$f":"IF(D250=Loop,$I$191,_xlfn.IFS($D251=Angle,(E251*K251)+I250,$D251=Loop,$I$190,OR($D251=\"\",$D251=End),I250,OR($D251=Dx,$D251=sx,$D251=up,$D251=down),(E251*K251)+I250))","v":{"v":0,"d":"0.00"}},{"v":1,"d":"1.0000"},{"v":0,"d":"0.0000"},{"v":0,"d":"0.00"},"","","","",0,null,{"$f":"+IF(G251=0,0,IF(MOD(G251,SpanTow),_xlfn.FLOOR.MATH(G251/SpanTow),_xlfn.FLOOR.MATH(G251/SpanTow)-1))","v":0},0,{"v":0,"d":"0.00"},null,false,false,false,false,false,false,false,null,null,{"v":0,"d":"0.00"},{"v":0,"d":"0.00"},0,0]
[null,{"$f":"_xlfn.IFS(C251=\"\",\"\",C251=\"\",\"\",AND(D252<>End,D251<>Loop),C251,D252=End,_xlfn.CONCAT(C251,\", \"&$F$11),D251=Loop,_xlfn.CONCAT($F$11&\" x2,1\"))","v":""},"","",{"v":0,"d":"0.00"},0,{"v":0,"d":"0.00"},{"$f":"IF(D251=Loop,$H$191,_xlfn.IFS($D252=Angle,(E252*J252)+H251,$D252=Loop,$H$190,OR($D252=\"\",$D252=End),H251,OR($D252=Dx,$D252=sx,$D252=up,$D252=down),(E252*J252)+H251))","v":{"v":0,"d":"0.00"}},{"$f":"IF(D251=Loop,$I$191,_xlfn.IFS($D252=Angle,(E252*K252)+I251,$D252=Loop,$I$190,OR($D252=\"\",$D252=End),I251,OR($D252=Dx,$D252=sx,$D252=up,$D252=down),(E252*K252)+I251))","v":{"v":0,"d":"0.00"}},{"v":1,"d":"1.0000"},{"v":0,"d":"0.0000"},{"v":0,"d":"0.00"},"",{"$f":"IF(D252=\"\",\"\",+IF(OR(AND(M252>=80,M252<=105),AND(M252>=265,M252<=280)),\"90\",FALSE))","v":""},{"$f":"IF(D252=\"\",\"\",+IF(OR(AND(M252>=165,M252<=195),AND(M252>=345,M252<=15)),\"INT\",FALSE))","v":""},{"$f":"IF(D252=\"\",\"\",IF(M252=\"\",\"\",+IF(AND(N252=FALSE,O252=FALSE),1,0)))","v":""},0,null,{"$f":"+IF(G252=0,0,IF(MOD(G252,SpanTow),_xlfn.FLOOR.MATH(G252/SpanTow),_xlfn.FLOOR.MATH(G252/SpanTow)-1))","v":0},0,{"v":0,"d":"0.00"},null,false,false,false,false,false,false,false,null,null,{"v":0,"d":"0.00"},{"v":0,"d":"0.00"},0,0]
[null,{"$f":"_xlfn.IFS(C252=\"\",\"\",C252=\"\",\"\",AND(D253<>End,D252<>Loop),C252,D253=End,_xlfn.CONCAT(C252,\", \"&$F$11),D252=Loop,_xlfn.CONCAT($F$11&\" x2,1\"))","v":""},{"$f":"IF(OR(D97=End,D97=Loop),F97,C101)","v":0},"",{"v":0,"d":"0.00"},0,{"v":0,"d":"0.00"},{"$f":"IF(D252=Loop,$H$191,_xlfn.IFS($D253=Angle,(E253*J253)+H252,$D253=Loop,$H$190,OR($D253=\"\",$D253=End),H252,OR($D253=Dx,$D253=sx,$D253=up,$D253=down),(E253*J253)+H252))","v":{"v":0,"d":"0.00"}},{"$f":"IF(D252=Loop,$I$191,_xlfn.IFS($D253=Angle,(E253*K253)+I252,$D253=Loop,$I$190,OR($D253=\"\",$D253=End),I252,OR($D253=Dx,$D253=sx,$D253=up,$D253=down),(E253*K253)+I252))","v":{"v":0,"d":"0.00"}},{"$f":"+COS(RADIANS(F253))","v":{"v":1,"d":"1.0000"}},{"$f":"SIN(RADIANS(F253))","v":{"v":0,"d":"0.0000"}},{"v":0,"d":"0.00"},null,{"$f":"IF(D253=\"\",\"\",+IF(OR(AND(M253>=80,M253<=105),AND(M253>=265,M253<=280)),\"90\",FALSE))","v":""},{"$f":"IF(D253=\"\",\"\",+IF(OR(AND(M253>=165,M253<=195),AND(M253>=345,M253<=15)),\"INT\",FALSE))","v":""},{"$f":"IF(D253=\"\",\"\",IF(M253=\"\",\"\",+IF(AND(N253=FALSE,O253=FALSE),1,0)))","v":""},{"$f":"+IF(OR(E253=0,E253=\"\"),0,IF(MOD(E253,$S$189),_xlfn.FLOOR.MATH(E253/$S$189),_xlfn.FLOOR.MATH(E253/$S$189)-1))","v":0},null,{"$f":"+IF(G253=0,0,IF(MOD(G253,SpanTow),_xlfn.FLOOR.MATH(G253/SpanTow),_xlfn.FLOOR.MATH(G253/SpanTow)-1))","v":0},{"$f":"+MAX(Q253:S253)","v":0},{"v":0,"d":"0.00"},null,false,false,false,false,false,false,false,null,null,{"v":0,"d":"0.00"},{"v":0,"d":"0.00"},0,0]
[]
[]
[{"$nulls":26},{"$f":"MAX(AA191:AA253)","v":0},null,null,"MAX"]

{"sheet":"SupLL","index":1,"n_rows":358,"n_cols":62,"rows_kept":358,"hidden":true,"merged":[[5,2,5,9],[6,2,6,9],[8,2,8,3],[8,4,8,10],[10,2,10,3],[10,4,10,5],[11,2,11,3],[11,4,11,5],[13,2,13,3],[13,4,13,5],[13,6,13,8],[17,4,17,5],[19,1,19,6],[20,1,21,2],[20,6,21,6],[22,1,22,2],[23,1,23,2],[30,2,30,7],[38,1,38,5],[39,1,39,5],[39,9,39,11],[40,1,40,5],[40,9,40,11],[98,1,98,2],[98,4,98,5],[99,1,99,2],[99,4,99,5],[102,1,102,11],[103,1,104,2],[103,3,103,5],[103,6,103,8],[103,9,103,11],[105,9,106,9],[105,10,106,10],[105,11,106,11],[110,1,110,3],[110,5,110,6],[112,1,112,4],[113,1,113,2],[113,3,113,4],[113,5,114,6],[114,1,114,2],[114,3,114,4],[146,2,146,8],[149,3,149,6],[150,3,150,4],[150,5,150,6],[155,2,155,8],[177,2,177,8],[281,1,282,1]]}
[]
[]
[]
[{"$nulls":10},"LIFELINE v1.04",{"$nulls":14},0,0,null,"Rothoblaas CABLE","Ø8 - 7 x 7 - stainless steel - AISI316",{"$nulls":4},"CC ID"]
[{"$nulls":20},">",null,"SPEAR2/SPEAR","SPEAR_SPEAR2.txt",null,1,12,null,"user *","input data --->",null,null,"INDEFORMABILE","INDEFORMABILE","N.S."]
[null,null,"LIFELINE SYSTEMS CALCULATION",{"$nulls":17},"<",{"$nulls":4},2,13,null,{"$f":"IF(E14=AC5,\"uservalues\",\"Rbcable\")","v":"Rbcable"},{"$nulls":3},"TOWER300","TOWER300.txt","002",null,"PATROL + SPEAR"]
[null,null,"Forces and deflection of the system",{"$nulls":17},"Λ",{"$nulls":4},3,14,{"$nulls":5},"TOWER400","TOWER400.txt","004",null,"PATROL + SPEAREVO"]
[{"$nulls":20},"V",{"$nulls":4},4,15,{"$nulls":5},"TOWER500","TOWER500.txt","005"]
[null,null,"Project Name",null,"ABC",{"$nulls":15},"Angle",{"$nulls":11},"TOWER","TOWER600.txt","003"]
[{"$nulls":32},"PATROLEND","PATROLEND.txt","001"]
[null,null,"System",null,"PATROL + SPEAR",null,null,"Data:",{"$f":"TODAY()","v":"2023-10-10"},{"$nulls":16},"user",{"$f":"H18*SIGN(H18)","v":{"v":15,"d":"15.0 kN"}},{"$nulls":5},"PATROL OVERHEAD","PATROLEND.txt","001"]
[null,null,"Anchor Point",null,"TOWER",{"$nulls":15},"Loop",{"$nulls":11},"PATROL ON WALL","PATROLEND.txt","001"]
[{"$nulls":10},"Nominal diameter ",8,"mm",{"$nulls":19},"SHIELD | SHIELD2"]
[null,null,"Rope",null,"Rothoblaas CABLE",null,{"$f":"VLOOKUP(E14,AC4:AD5,2,)","v":"Ø8 - 7 x 7 - stainless steel - AISI316"},{"$nulls":3},"Fill ratio ",64,"%"]
[{"$nulls":10},"Apparent Young's Modulus ",110000,"N/mm2"]
[{"$nulls":10},"Specific weight",{"v":76977.1,"d":"76977"},"N/m3"]
[]
[null,null,"Max number of users",null,{"$f":"IF(E11=AK7,VLOOKUP(VLOOKUP(E12,AA100:AB107,2,FALSE),AA122:AE123,5,FALSE),VLOOKUP(VLOOKUP(E12,AA100:AB107,2,FALSE),AA111:AE113,5,FALSE))","v":4},null,null,{"v":-15,"d":"-15.0"},"kN"]
[]
[null,"Installation manual loads (EN795)"]
[null,"Application",null,"Span","Max deflection","Fmax","Number of users"]
[{"$nulls":3},"[m]","[m]","[kN]"]
[null,{"$f":"IF(VLOOKUP(E12,AA100:AB107,2,FALSE)=\"WALL\",\"HORIZONTAL/WALL\",\"HORIZONTAL\")","v":"HORIZONTAL"},null,{"$f":"+MaxSpan","v":""},{"$f":"IF(E11=AK7,VLOOKUP(VLOOKUP(E12,AA100:AB107,2,FALSE),AA122:AE123,4,FALSE),VLOOKUP(VLOOKUP(E12,AA100:AB107,2,FALSE),AA111:AE113,4,FALSE))","v":3.26},{"$f":"IF(E11=AK7,VLOOKUP(VLOOKUP(E12,AA100:AB107,2,FALSE),AA122:AE123,3,FALSE),VLOOKUP(VLOOKUP(E12,AA100:AB107,2,FALSE),AA111:AE113,3,FALSE))","v":16.5},{"$f":"IF(E11=AK7,VLOOKUP(VLOOKUP(E12,AA100:AB107,2,FALSE),AA122:AE123,5,FALSE),VLOOKUP(VLOOKUP(E12,AA100:AB107,2,FALSE),AA111:AE113,5,FALSE))","v":4}]
[null,{"$f":"IF(VLOOKUP(E12,AA100:AB107,2,FALSE)=\"WALL\",\"HORIZONTAL/WALL\",\"HORIZONTAL\")","v":"HORIZONTAL"},null,{"$f":"IF(E11=AK7,VLOOKUP(VLOOKUP(E12,AA100:AB107,2,FALSE),AG122:AK123,2,FALSE),VLOOKUP(VLOOKUP(E12,AA100:AB107,2,FALSE),AG111:AK113,2,FALSE))","v":{"v":2,"d":"2.0"}},{"$f":"IF(E11=AK7,VLOOKUP(VLOOKUP(E12,AA100:AB107,2,FALSE),AG122:AK123,4,FALSE),VLOOKUP(VLOOKUP(E12,AA100:AB107,2,FALSE),AG111:AK113,4,FALSE))","v":1.26},{"$f":"IF(E11=AK7,VLOOKUP(VLOOKUP(E12,AA100:AB107,2,FALSE),AG122:AK123,3,FALSE),VLOOKUP(VLOOKUP(E12,AA100:AB107,2,FALSE),AG111:AK113,3,FALSE))","v":8.2},{"$f":"IF(E11=AK7,VLOOKUP(VLOOKUP(E12,AA100:AB107,2,FALSE),AG122:AK123,5,FALSE),VLOOKUP(VLOOKUP(E12,AA100:AB107,2,FALSE),AG111:AK113,5,FALSE))","v":4}]
[]
[]
[]
[]
[]
[]
[null,null,"GEOMETRY OF THE LIFELINE"]
[]
[{"$nulls":4},"X","Y"]
[null,null,"First Point",null,{"v":0,"d":"0.00"},{"v":0,"d":"0.00"},"m"]
[]
[null,null,"Total length",null,{"$f":"+TotLung","v":{"v":0,"d":"0.0"}},"m"]
[]
[null,null,"Draw your lifeline system via table 1"]
[null,"It is not recommended to have a lifeline with angles of less than 90°. In such cases, it is recommended to split the lifeline at that point.",{"$nulls":12},"num anc int"]
[{"$nulls":14},"NON CANCELLARE NE SPOSTARE"]
[null,"Table 1 - Vector Input",{"$nulls":12},{"$f":"MAX(B43:B96,J43:J96)","v":7},{"$nulls":14},"# operatori","carico",{"$nulls":6},"Fx","Fy","angolo inclinazione forza"]
[null,"From","To","Direction","Length","Angle °",{"$nulls":21},"Length",null,"numero","kN","invertire il segno della forza?","check","ANCORAGGIO","campata","check","DISSIPATORE","kN","kN","gradi",null,"X","Y"]
[null,1,2,">",{"v":10,"d":"10.00"},{"$nulls":9},{"$f":"IF(AND(OR(K43<>\"\", L43<>\"\"), OR(D43<>\"\", E43<>\"\")), \"! ! ! Do not fill both tables\", \"\")","v":""},{"$f":"IF(O43=\"\",0,1)","v":0},null,"Nome grafico linea indeformata:",{"$nulls":9},{"$f":"IF(F290=0,\"\",F290)","v":""},null,{"$f":"IF(IF(AI43=$E$100,1,0)=1, $E$18,0)","v":0},{"$f":"VLOOKUP(AD43,$Z$4:$AA$11,2,)*IF(AF43=\"Y\",-1,1)","v":0},{"$f":"IF(AND($E$18=\"user\",$H$18<0),\"Y\",\"N\")","v":"N"},{"$f":"IF(AND(OR(D43=\"\",E43=\"\"),OR(K43=\"\",L43=\"\"),AD43<>0),\"The span where the force has been placed do not exist ! ! !\",\"ok\")","v":"ok"},{"$f":"$E$12","v":"TOWER"},1,{"$f":"IF(AG43=\"ok\",0,1)","v":0},"SPEAR2/SPEAR",{"$f":"ROUND(AE43*SIN(90*PI()/180+ATAN(1/IF(G290-G289=0,(H290-H289)/(G290-G289+0.00001),IF(H290=0,(H290+0.00001-H289)/(G290-G289),IF(G290=0,(H290-H289)/(G290+0.00001-G289),IF(H290-H289=0, (H290-H289+0.00001)/(G290-G289), (H290-H289)/(G290-G289))))))),2)","v":{"v":0,"d":"0.00"}},{"$f":"ROUND(AE43*COS(90*PI()/180+ATAN(1/IF(G290-G289=0,(H290-H289)/(G290-G289+0.00001), IF(H290=0,(H290+0.00001-H289)/(G290-G289),IF(G290=0,(H290-H289)/(G290+0.00001-G289),IF(H290-H289=0,(H290-H289+0.00001)/(G290-G289),(H290-H289)/(G290-G289))))))),2)","v":{"v":0,"d":"0.00"}},{"$f":"DEGREES(IF(AND(AL43>0,AM43>=0),ATAN(ABS(AM43/AL43)),IF(AND(AL43>0,AM43<0),-PI()/2+ATAN(ABS(AM43/AL43)),IF(AND(AL43<0,AM43>0),PI()/2+ATAN(ABS(AM43/AL43)),IF(AND(AL43<0,AM43<=0),PI()+ATAN(ABS(AM43/AL43)),IF(AND(AL43=0,AM43>0),0.5*PI(),IF(AND(AL43=0,AM43<0),-0.5*PI(),\"Fx et Fy = ?\")))))))","v":{"$error":"#VALUE!"}},null,{"$f":"(SupLL!G290+SupLL!G289)/2","v":{"v":5,"d":"5.0"}},{"$f":"(SupLL!H290+SupLL!H289)/2","v":{"v":0,"d":"0.0"}}]
[null,{"$f":"IF(OR(D43<>\"\",D43<>\"End\"),IF(AND(E43=\"\",D43=\"\"),IF(B43<10, +C43, 0),+C43),0)","v":2},{"$f":"IF(D44=\"Loop\",$B$43,IF(OR(D44<>\"\",E44<>\"\",AND(C43<10,ROW(C43)<48)),C43+1,0))","v":3},"Λ",{"v":5,"d":"5.00"},{"$nulls":9},{"$f":"IF(AND(OR(K44<>\"\", L44<>\"\"), OR(D44<>\"\", E44<>\"\")), \"! ! ! Do not fill both tables\", \"\")","v":""},{"$f":"IF(O44=\"\",0,1)","v":0},null,"Indeformata",{"$nulls":9},"",null,0,0,"N","ok",{"$f":"$E$12","v":"TOWER"},2,{"$f":"IF(AG44=\"ok\",0,1)","v":0},null,{"v":0,"d":"0.00"},{"v":0,"d":"0.00"},{"$error":"#VALUE!"},null,{"$f":"(SupLL!G291+SupLL!G290)/2","v":{"v":10,"d":"10.0"}},{"$f":"(SupLL!H291+SupLL!H290)/2","v":2.5}]
[null,3,4,">",{"v":6,"d":"6.00"},{"$nulls":9},"",0,{"$nulls":11},"",null,0,0,"N","ok","TOWER",3,0,null,{"v":0,"d":"0.00"},{"v":0,"d":"0.00"},{"$error":"#VALUE!"},null,{"$f":"(SupLL!G292+SupLL!G291)/2","v":{"v":13,"d":"13.0"}},{"$f":"(SupLL!H292+SupLL!H291)/2","v":{"v":5,"d":"5.0"}}]
[null,4,5,"V",{"v":10,"d":"10.00"},{"$nulls":9},"",0,{"$nulls":11},"",null,0,0,"N","ok","TOWER",4,0,null,{"v":0,"d":"0.00"},{"v":0,"d":"0.00"},{"$error":"#VALUE!"},null,{"$f":"(SupLL!G293+SupLL!G292)/2","v":{"v":16,"d":"16.0"}},{"$f":"(SupLL!H293+SupLL!H292)/2","v":{"v":0,"d":"0.0"}}]
[null,5,6,"<",{"v":12.5,"d":"12.50"},{"$nulls":9},"",0,{"$nulls":11},"",null,0,0,"N","ok","TOWER",5,0,null,{"v":0,"d":"0.00"},{"v":0,"d":"0.00"},{"$error":"#VALUE!"},null,{"$f":"(SupLL!G294+SupLL!G293)/2","v":{"v":9.75,"d":"9.8"}},{"$f":"(SupLL!H294+SupLL!H293)/2","v":{"v":-5,"d":"-5.0"}}]
[null,6,7,{"$nulls":11},"",0,{"$nulls":11},"",null,0,0,"N","ok","TOWER",6,0,null,{"$error":"#DIV/0!"},{"$error":"#DIV/0!"},{"$error":"#DIV/0!"},null,{"$f":"(SupLL!G295+SupLL!G294)/2","v":3.5},{"$f":"(SupLL!H295+SupLL!H294)/2","v":{"v":-5,"d":"-5.0"}}]
[null,7,0,{"$nulls":11},"",0,{"$nulls":11},"",null,0,0,"N","ok","TOWER",7,0,null,{"$error":"#DIV/0!"},{"$error":"#DIV/0!"},{"$error":"#DIV/0!"},null,{"$f":"(SupLL!G296+SupLL!G295)/2","v":3.5},{"$f":"(SupLL!H296+SupLL!H295)/2","v":{"v":-5,"d":"-5.0"}}]
[null,0,0,{"$nulls":11},"",0,{"$nulls":11},"",null,0,0,"N","ok","TOWER",8,0,null,{"$error":"#DIV/0!"},{"$error":"#DIV/0!"},{"$error":"#DIV/0!"},null,{"$f":"(SupLL!G297+SupLL!G296)/2","v":3.5},{"$f":"(SupLL!H297+SupLL!H296)/2","v":{"v":-5,"d":"-5.0"}}]
[null,0,0,{"$nulls":11},"",0,{"$nulls":11},"",null,0,0,"N","ok","TOWER",9,0,null,{"$error":"#DIV/0!"},{"$error":"#DIV/0!"},{"$error":"#DIV/0!"},null,{"$f":"(SupLL!G298+SupLL!G297)/2","v":3.5},{"$f":"(SupLL!H298+SupLL!H297)/2","v":{"v":-5,"d":"-5.0"}}]
[null,0,0,{"$nulls":11},"",0,{"$nulls":11},"",null,0,0,"N","ok","TOWER",10,0,null,{"$error":"#DIV/0!"},{"$error":"#DIV/0!"},{"$error":"#DIV/0!"},null,{"$f":"(SupLL!G299+SupLL!G298)/2","v":3.5},{"$f":"(SupLL!H299+SupLL!H298)/2","v":{"v":-5,"d":"-5.0"}}]
[null,0,0,{"$nulls":11},"",0,{"$nulls":11},{"$f":"IF(F347=0,\"\",F347)","v":""},null,0,0,"N","ok","TOWER",11,0,null,{"$error":"#DIV/0!"},{"$error":"#DIV/0!"},{"$error":"#DIV/0!"},null,{"$f":"(SupLL!G300+SupLL!G299)/2","v":3.5},{"$f":"(SupLL!H300+SupLL!H299)/2","v":{"v":-5,"d":"-5.0"}}]
[null,0,0,{"$nulls":11},"",0,{"$nulls":11},{"$f":"IF(F348=0,\"\",F348)","v":"MIN"},null,0,0,"N","ok","TOWER",12,0,null,{"$error":"#DIV/0!"},{"$error":"#DIV/0!"},{"$error":"#DIV/0!"},null,{"$f":"(SupLL!G301+SupLL!G300)/2","v":3.5},{"$f":"(SupLL!H301+SupLL!H300)/2","v":{"v":-5,"d":"-5.0"}}]
[null,0,0,{"$nulls":11},"",0,{"$nulls":11},{"$f":"IF(F349=0,\"\",F349)","v":"MAX"},null,0,0,"N","ok","TOWER",13,0,null,{"$error":"#DIV/0!"},{"$error":"#DIV/0!"},{"$error":"#DIV/0!"},null,{"$f":"(SupLL!G302+SupLL!G301)/2","v":3.5},{"$f":"(SupLL!H302+SupLL!H301)/2","v":{"v":-5,"d":"-5.0"}}]
[null,0,0,{"$nulls":11},"",0,{"$nulls":11},{"$f":"IF(F350=0,\"\",F350)","v":""},null,0,0,"N","ok","TOWER",14,0,null,{"$error":"#DIV/0!"},{"$error":"#DIV/0!"},{"$error":"#DIV/0!"},null,{"$f":"(SupLL!G303+SupLL!G302)/2","v":3.5},{"$f":"(SupLL!H303+SupLL!H302)/2","v":{"v":-5,"d":"-5.0"}}]
[null,0,0,{"$nulls":11},"",0,{"$nulls":11},{"$f":"IF(F351=0,\"\",F351)","v":""},null,0,0,"N","ok","TOWER",15,0,null,{"$error":"#DIV/0!"},{"$error":"#DIV/0!"},{"$error":"#DIV/0!"},null,{"$f":"(SupLL!G304+SupLL!G303)/2","v":3.5},{"$f":"(SupLL!H304+SupLL!H303)/2","v":{"v":-5,"d":"-5.0"}}]
[null,0,0,{"$nulls":11},"",0,{"$nulls":13},0,0,"N","ok","TOWER",16,0,null,{"$error":"#DIV/0!"},{"$error":"#DIV/0!"},{"$error":"#DIV/0!"},null,{"$f":"(SupLL!G305+SupLL!G304)/2","v":3.5},{"$f":"(SupLL!H305+SupLL!H304)/2","v":{"v":-5,"d":"-5.0"}}]
[null,0,0,{"$nulls":11},"",0,{"$nulls":13},0,0,"N","ok","TOWER",17,0,null,{"$error":"#DIV/0!"},{"$error":"#DIV/0!"},{"$error":"#DIV/0!"},null,{"$f":"(SupLL!G306+SupLL!G305)/2","v":3.5},{"$f":"(SupLL!H306+SupLL!H305)/2","v":{"v":-5,"d":"-5.0"}}]
[null,0,0,{"$nulls":11},"",0,{"$nulls":13},0,0,"N","ok","TOWER",18,0,null,{"$error":"#DIV/0!"},{"$error":"#DIV/0!"},{"$error":"#DIV/0!"},null,{"$f":"(SupLL!G307+SupLL!G306)/2","v":3.5},{"$f":"(SupLL!H307+SupLL!H306)/2","v":{"v":-5,"d":"-5.0"}}]
[null,0,0,{"$nulls":11},"",0,{"$nulls":13},0,0,"N","ok","TOWER",19,0,null,{"$error":"#DIV/0!"},{"$error":"#DIV/0!"},{"$error":"#DIV/0!"},null,{"$f":"(SupLL!G308+SupLL!G307)/2","v":3.5},{"$f":"(SupLL!H308+SupLL!H307)/2","v":{"v":-5,"d":"-5.0"}}]
[null,0,0,{"$nulls":11},"",0,{"$nulls":13},0,0,"N","ok",{"$f":"AH61","v":"TOWER"},20,0,null,{"$error":"#DIV/0!"},{"$error":"#DIV/0!"},{"$error":"#DIV/0!"},null,{"$f":"(SupLL!G309+SupLL!G308)/2","v":3.5},{"$f":"(SupLL!H309+SupLL!H308)/2","v":{"v":-5,"d":"-5.0"}}]
[null,0,0,{"$nulls":11},"",0,{"$nulls":13},0,0,"N","ok","TOWER",21,0,null,{"$error":"#DIV/0!"},{"$error":"#DIV/0!"},{"$error":"#DIV/0!"},null,{"$f":"(SupLL!G310+SupLL!G309)/2","v":3.5},{"$f":"(SupLL!H310+SupLL!H309)/2","v":{"v":-5,"d":"-5.0"}}]
[null,0,0,{"$nulls":11},"",0,{"$nulls":13},0,0,"N","ok","TOWER",22,0,null,{"$error":"#DIV/0!"},{"$error":"#DIV/0!"},{"$error":"#DIV/0!"},null,{"$f":"(SupLL!G311+SupLL!G310)/2","v":3.5},{"$f":"(SupLL!H311+SupLL!H310)/2","v":{"v":-5,"d":"-5.0"}}]
[null,0,0,{"$nulls":11},"",0,{"$nulls":13},0,0,"N","ok","TOWER",23,0,null,{"$error":"#DIV/0!"},{"$error":"#DIV/0!"},{"$error":"#DIV/0!"},null,{"$f":"(SupLL!G312+SupLL!G311)/2","v":3.5},{"$f":"(SupLL!H312+SupLL!H311)/2","v":{"v":-5,"d":"-5.0"}}]
[null,0,0,{"$nulls":11},"",0,{"$nulls":13},0,0,"N","ok","TOWER",24,0,null,{"$error":"#DIV/0!"},{"$error":"#DIV/0!"},{"$error":"#DIV/0!"},null,{"$f":"(SupLL!G313+SupLL!G312)/2","v":3.5},{"$f":"(SupLL!H313+SupLL!H312)/2","v":{"v":-5,"d":"-5.0"}}]
[null,0,0,{"$nulls":11},"",0,{"$nulls":13},0,0,"N","ok","TOWER",25,0,null,{"$error":"#DIV/0!"},{"$error":"#DIV/0!"},{"$error":"#DIV/0!"},null,{"$f":"(SupLL!G314+SupLL!G313)/2","v":3.5},{"$f":"(SupLL!H314+SupLL!H313)/2","v":{"v":-5,"d":"-5.0"}}]
[null,0,0,{"$nulls":11},"",0,{"$nulls":13},0,0,"N","ok","TOWER",26,0,null,{"$error":"#DIV/0!"},{"$error":"#DIV/0!"},{"$error":"#DIV/0!"},null,{"$f":"(SupLL!G315+SupLL!G314)/2","v":3.5},{"$f":"(SupLL!H315+SupLL!H314)/2","v":{"v":-5,"d":"-5.0"}}]
[null,0,0,{"$nulls":11},"",0,{"$nulls":13},0,0,"N","ok","TOWER",27,0,null,{"$error":"#DIV/0!"},{"$error":"#DIV/0!"},{"$error":"#DIV/0!"},null,{"$f":"(SupLL!G316+SupLL!G315)/2","v":3.5},{"$f":"(SupLL!H316+SupLL!H315)/2","v":{"v":-5,"d":"-5.0"}}]
[null,0,0,{"$nulls":11},"",0,{"$nulls":13},0,0,"N","ok","TOWER",28,0,null,{"$error":"#DIV/0!"},{"$error":"#DIV/0!"},{"$error":"#DIV/0!"},null,{"$f":"(SupLL!G317+SupLL!G316)/2","v":3.5},{"$f":"(SupLL!H317+SupLL!H316)/2","v":{"v":-5,"d":"-5.0"}}]
[null,0,0,{"$nulls":11},"",0,{"$nulls":13},0,0,"N","ok","TOWER",29,0,null,{"$error":"#DIV/0!"},{"$error":"#DIV/0!"},{"$error":"#DIV/0!"},null,{"$f":"(SupLL!G318+SupLL!G317)/2","v":3.5},{"$f":"(SupLL!H318+SupLL!H317)/2","v":{"v":-5,"d":"-5.0"}}]
[null,0,0,{"$nulls":11},"",0,{"$nulls":13},0,0,"N","ok","TOWER",30,0,null,{"$error":"#DIV/0!"},{"$error":"#DIV/0!"},{"$error":"#DIV/0!"},null,{"$f":"(SupLL!G319+SupLL!G318)/2","v":3.5},{"$f":"(SupLL!H319+SupLL!H318)/2","v":{"v":-5,"d":"-5.0"}}]
[null,0,0,{"$nulls":11},"",0,{"$nulls":13},0,0,"N","ok","TOWER",31,0,null,{"$error":"#DIV/0!"},{"$error":"#DIV/0!"},{"$error":"#DIV/0!"},null,{"$f":"(SupLL!G320+SupLL!G319)/2","v":3.5},{"$f":"(SupLL!H320+SupLL!H319)/2","v":{"v":-5,"d":"-5.0"}}]
[null,0,0,{"$nulls":11},"",0,{"$nulls":13},0,0,"N","ok","TOWER",32,0,null,{"$error":"#DIV/0!"},{"$error":"#DIV/0!"},{"$error":"#DIV/0!"},null,{"$f":"(SupLL!G321+SupLL!G320)/2","v":3.5},{"$f":"(SupLL!H321+SupLL!H320)/2","v":{"v":-5,"d":"-5.0"}}]
[null,0,0,{"$nulls":11},"",0,{"$nulls":13},0,0,"N","ok","TOWER",33,0,null,{"$error":"#DIV/0!"},{"$error":"#DIV/0!"},{"$error":"#DIV/0!"},null,{"$f":"(SupLL!G322+SupLL!G321)/2","v":3.5},{"$f":"(SupLL!H322+SupLL!H321)/2","v":{"v":-5,"d":"-5.0"}}]
[null,0,0,{"$nulls":11},"",0,{"$nulls":13},0,0,"N","ok","TOWER",34,0,null,{"$error":"#DIV/0!"},{"$error":"#DIV/0!"},{"$error":"#DIV/0!"},null,{"$f":"(SupLL!G323+SupLL!G322)/2","v":3.5},{"$f":"(SupLL!H323+SupLL!H322)/2","v":{"v":-5,"d":"-5.0"}}]
[null,0,0,{"$nulls":11},"",0,{"$nulls":13},0,0,"N","ok","TOWER",35,0,null,{"$error":"#DIV/0!"},{"$error":"#DIV/0!"},{"$error":"#DIV/0!"},null,{"$f":"(SupLL!G324+SupLL!G323)/2","v":3.5},{"$f":"(SupLL!H324+SupLL!H323)/2","v":{"v":-5,"d":"-5.0"}}]
[null,0,0,{"$nulls":11},"",0,{"$nulls":13},0,0,"N","ok","TOWER",36,0,null,{"$error":"#DIV/0!"},{"$error":"#DIV/0!"},{"$error":"#DIV/0!"},null,{"$f":"(SupLL!G325+SupLL!G324)/2","v":3.5},{"$f":"(SupLL!H325+SupLL!H324)/2","v":{"v":-5,"d":"-5.0"}}]
[null,0,0,{"$nulls":11},"",0,{"$nulls":13},0,0,"N","ok","TOWER",37,0,null,{"$error":"#DIV/0!"},{"$error":"#DIV/0!"},{"$error":"#DIV/0!"},null,{"$f":"(SupLL!G326+SupLL!G325)/2","v":3.5},{"$f":"(SupLL!H326+SupLL!H325)/2","v":{"v":-5,"d":"-5.0"}}]
[null,0,0,{"$nulls":11},"",0,{"$nulls":13},0,0,"N","ok","TOWER",38,0,null,{"$error":"#DIV/0!"},{"$error":"#DIV/0!"},{"$error":"#DIV/0!"},null,{"$f":"(SupLL!G327+SupLL!G326)/2","v":3.5},{"$f":"(SupLL!H327+SupLL!H326)/2","v":{"v":-5,"d":"-5.0"}}]
[null,0,0,{"$nulls":11},"",0,{"$nulls":13},0,0,"N","ok","TOWER",39,0,null,{"$error":"#DIV/0!"},{"$error":"#DIV/0!"},{"$error":"#DIV/0!"},null,{"$f":"(SupLL!G328+SupLL!G327)/2","v":3.5},{"$f":"(SupLL!H328+SupLL!H327)/2","v":{"v":-5,"d":"-5.0"}}]
[null,0,0,{"$nulls":11},"",0,{"$nulls":13},0,0,"N","ok","TOWER",40,0,null,{"$error":"#DIV/0!"},{"$error":"#DIV/0!"},{"$error":"#DIV/0!"},null,{"$f":"(SupLL!G329+SupLL!G328)/2","v":3.5},{"$f":"(SupLL!H329+SupLL!H328)/2","v":{"v":-5,"d":"-5.0"}}]
[null,0,0,{"$nulls":11},"",0,{"$nulls":13},0,0,"N","ok","TOWER",41,0,null,{"$error":"#DIV/0!"},{"$error":"#DIV/0!"},{"$error":"#DIV/0!"},null,{"$f":"(SupLL!G330+SupLL!G329)/2","v":3.5},{"$f":"(SupLL!H330+SupLL!H329)/2","v":{"v":-5,"d":"-5.0"}}]
[null,0,0,{"$nulls":11},"",0,{"$nulls":13},0,0,"N","ok","TOWER",42,0,null,{"$error":"#DIV/0!"},{"$error":"#DIV/0!"},{"$error":"#DIV/0!"},null,{"$f":"(SupLL!G331+SupLL!G330)/2","v":3.5},{"$f":"(SupLL!H331+SupLL!H330)/2","v":{"v":-5,"d":"-5.0"}}]
[null,0,0,{"$nulls":11},"",0,{"$nulls":13},0,0,"N","ok","TOWER",43,0,null,{"$error":"#DIV/0!"},{"$error":"#DIV/0!"},{"$error":"#DIV/0!"},null,{"$f":"(SupLL!G332+SupLL!G331)/2","v":3.5},{"$f":"(SupLL!H332+SupLL!H331)/2","v":{"v":-5,"d":"-5.0"}}]
[null,0,0,{"$nulls":11},"",0,{"$nulls":13},0,0,"N","ok","TOWER",44,0,null,{"$error":"#DIV/0!"},{"$error":"#DIV/0!"},{"$error":"#DIV/0!"},null,{"$f":"(SupLL!G333+SupLL!G332)/2","v":3.5},{"$f":"(SupLL!H333+SupLL!H332)/2","v":{"v":-5,"d":"-5.0"}}]
[null,0,0,{"$nulls":11},"",0,{"$nulls":13},0,0,"N","ok","TOWER",45,0,null,{"$error":"#DIV/0!"},{"$error":"#DIV/0!"},{"$error":"#DIV/0!"},null,{"$f":"(SupLL!G334+SupLL!G333)/2","v":3.5},{"$f":"(SupLL!H334+SupLL!H333)/2","v":{"v":-5,"d":"-5.0"}}]
[null,0,0,{"$nulls":11},"",0,{"$nulls":13},0,0,"N","ok","TOWER",46,0,null,{"$error":"#DIV/0!"},{"$error":"#DIV/0!"},{"$error":"#DIV/0!"},null,{"$f":"(SupLL!G335+SupLL!G334)/2","v":3.5},{"$f":"(SupLL!H335+SupLL!H334)/2","v":{"v":-5,"d":"-5.0"}}]
[null,0,0,{"$nulls":11},"",0,{"$nulls":13},0,0,"N","ok","TOWER",47,0,null,{"$error":"#DIV/0!"},{"$error":"#DIV/0!"},{"$error":"#DIV/0!"},null,{"$f":"(SupLL!G336+SupLL!G335)/2","v":3.5},{"$f":"(SupLL!H336+SupLL!H335)/2","v":{"v":-5,"d":"-5.0"}}]
[null,0,0,{"$nulls":11},"",0,{"$nulls":13},0,0,"N","ok","TOWER",48,0,null,{"$error":"#DIV/0!"},{"$error":"#DIV/0!"},{"$error":"#DIV/0!"},null,{"$f":"(SupLL!G337+SupLL!G336)/2","v":3.5},{"$f":"(SupLL!H337+SupLL!H336)/2","v":{"v":-5,"d":"-5.0"}}]
[null,0,0,{"$nulls":11},"",0,{"$nulls":13},0,0,"N","ok","TOWER",49,0,null,{"$error":"#DIV/0!"},{"$error":"#DIV/0!"},{"$error":"#DIV/0!"},null,{"$f":"(SupLL!G338+SupLL!G337)/2","v":3.5},{"$f":"(SupLL!H338+SupLL!H337)/2","v":{"v":-5,"d":"-5.0"}}]
[null,0,0,{"$nulls":11},"",0,{"$nulls":13},0,0,"N","ok","TOWER",50,0,null,{"$error":"#DIV/0!"},{"$error":"#DIV/0!"},{"$error":"#DIV/0!"},null,{"$f":"(SupLL!G339+SupLL!G338)/2","v":3.5},{"$f":"(SupLL!H339+SupLL!H338)/2","v":{"v":-5,"d":"-5.0"}}]
[null,0,0,{"$nulls":11},"",0,{"$nulls":13},0,0,"N","ok","TOWER",51,0,null,{"$error":"#DIV/0!"},{"$error":"#DIV/0!"},{"$error":"#DIV/0!"},null,{"$f":"(SupLL!G340+SupLL!G339)/2","v":3.5},{"$f":"(SupLL!H340+SupLL!H339)/2","v":{"v":-5,"d":"-5.0"}}]
[null,0,0,{"$nulls":11},"",0,{"$nulls":13},0,0,"N","ok","TOWER",52,0,null,{"$error":"#DIV/0!"},{"$error":"#DIV/0!"},{"$error":"#DIV/0!"},null,{"$f":"(SupLL!G341+SupLL!G340)/2","v":3.5},{"$f":"(SupLL!H341+SupLL!H340)/2","v":{"v":-5,"d":"-5.0"}}]
[null,0,0,{"$nulls":11},"",0,{"$nulls":13},0,0,"N","ok","TOWER",53,0,null,{"$error":"#DIV/0!"},{"$error":"#DIV/0!"},{"$error":"#DIV/0!"},null,{"$f":"(SupLL!G342+SupLL!G341)/2","v":3.5},{"$f":"(SupLL!H342+SupLL!H341)/2","v":{"v":-5,"d":"-5.0"}}]
[null,0,0,{"$nulls":11},"",0,{"$nulls":16},"ok","TOWER",54,0]
[{"$nulls":34},55]
[]
[null,"Max length span",null,"[m]",{"$f":"MAX(E43:E96)","v":{"v":12.5,"d":"12.50"}},{"$nulls":12},"deflection",{"$f":"IF((IF(ProjSpan=MaxSpan,MaxDef,IF(ProjSpan=MinSpan,MinDef,_xlfn.FORECAST.LINEAR(ProjSpan,DefDB,SpanDB)+IF(AND(ProjSpan>MinSpan,ProjSpan<MaxSpan),0.1,0))))>MaxDef,MaxDef,IF(ProjSpan=MaxSpan,MaxDef,IF(ProjSpan=MinSpan,MinDef,_xlfn.FORECAST.LINEAR(ProjSpan,DefDB,SpanDB)+IF(AND(ProjSpan>MinSpan,ProjSpan<MaxSpan),0.1,0))))","v":""},"m"]
[null,"Load applied on span",null,null,{"$f":"VLOOKUP(MATCH(MAX(E43:E96),E43:E96,0),B43:C96,1,FALSE)&\" - \"&VLOOKUP(MATCH(MAX(E43:E96),E43:E96,0),B43:C96,2,FALSE)","v":"5 - 6"},{"$nulls":21},"TOWER300","TOWER"]
[{"$nulls":14},"Length",{"$f":"+TotLung","v":{"v":0,"d":"0.0"}},"m","E rope",109000,"N/mmq",{"$nulls":6},"TOWER400","TOWER"]
[{"$nulls":14},"A rope",{"$f":"PI()*4^2","v":50.26548245743669},"mmq",{"$nulls":9},"TOWER500","TOWER"]
[null,"Reaction on anchor elements of the multi-span rope",{"$nulls":12},"F Ed",{"$f":"+Calculator!G111","v":""},"kN","Delta l",{"$f":"(P103*1000*P101*1000)/(P102*S101)","v":{"$error":"#VALUE!"}},"mm","PATROL + TOWER + SPEAR",null,"[4UTENTI]",{"$nulls":3},"TOWER","TOWER"]
[null,"Element",null,"Intermediate",null,null,"Terminal",null,null,"Curve",{"$nulls":7},"Delta def",{"$f":"S103*SIN(RADIANS(P105))","v":{"$error":"#VALUE!"}},"mm","CAMPATA (M)","FORZA MASSIMA AL TERMINALE (KN)","FRECCIA CENTRO CAMPATA (M)",{"$nulls":3},"PATROLEND","WALL",{"$nulls":12},"h","l"]
[{"$nulls":3},"F1 [kN]","F2 [kN]","Module [kN]","F1 [kN]","F2 [kN]","Module [kN]","F1 [kN]","F2 [kN]","Module [kN]",null,null,"teta",{"$f":"DEGREES(ATAN((2*S99)/ProjSpan))","v":{"$error":"#VALUE!"}},{"$nulls":4},15,16.5,3.26,{"$nulls":3},"PATROL OVERHEAD","WALL",{"$nulls":13},2,6,8,10,12,15]
[null,"anchors at the loaded span",null,{"$f":"P107","v":{"$error":"#VALUE!"}},{"$f":"P106","v":{"$error":"#VALUE!"}},{"$f":"_xlfn.FORECAST.LINEAR(E99,F23:F24,D23:D24)","v":{"$error":"#DIV/0!"}},{"$f":"P107","v":{"$error":"#VALUE!"}},{"$f":"P106","v":{"$error":"#VALUE!"}},{"$f":"_xlfn.FORECAST.LINEAR(E99,F23:F24,D23:D24)","v":{"$error":"#DIV/0!"}},{"$f":"VLOOKUP(BH348,BH290:BJ344,2,FALSE)","v":{"$error":"#DIV/0!"}},{"$f":"VLOOKUP(BH348,BH290:BJ344,3,FALSE)","v":{"$error":"#DIV/0!"}},{"$f":"BH348","v":{"$error":"#DIV/0!"}},null,null,"fy - f2",{"$f":"P103*SIN(RADIANS(P105))","v":{"$error":"#VALUE!"}},null,null,{"$f":"+ROUND(S103/1000,2)","v":{"$error":"#VALUE!"}},null,2,8.2,1.26,{"$nulls":3},"PATROL ON WALL","WALL",{"$nulls":11},"tower300",300,1.26,1.55,1.77,1.97,2.15,2.4]
[null,"anchors at the unloaded span",null,{"v":0,"d":"0.0"},{"v":0,"d":"0.0"},{"v":0,"d":"0.0"},{"$f":"_xlfn.FORECAST.LINEAR(E99,F23:F24,D23:D24)","v":{"$error":"#DIV/0!"}},{"v":0,"d":"0.0"},{"$f":"G107","v":{"$error":"#DIV/0!"}},{"$nulls":5},"fx - f1",{"$f":"P103*COS(RADIANS(P105))","v":{"$error":"#VALUE!"}},{"$nulls":4},"PATROL + SHIELD + SPEAR",null,"[2UTENTI]",{"$nulls":3},"SHIELD | SHIELD2","SHIELD",{"$nulls":11},"tower400",400]
[{"$nulls":20},"CAMPATA (M)","FORZA MASSIMA AL TERMINALE (KN)","FRECCIA CENTRO CAMPATA (M)",{"$nulls":16},"tower500",500]
[{"$nulls":20},7.5,17.1,1.44,{"$nulls":3},"MAX",{"$nulls":5},"MIN",{"$nulls":6},"tower600",600,1.33,2.1,2.4,2.66,2.9,3.26]
[{"$nulls":15},"anchors at the loaded span",{"$nulls":4},2,12.5,0.62,{"$nulls":4},"CAMPATA (M)","FORZA MASSIMA AL TERMINALE (KN)","FRECCIA CENTRO CAMPATA (M)","users",null,null,"CAMPATA (M)","FORZA MASSIMA AL TERMINALE (KN)","FRECCIA CENTRO CAMPATA (M)","users"]
[null,"Max design load",null,null,"[kN]",{"$f":"MAX(F106:F107,I106:I107,L106)","v":{"$error":"#DIV/0!"}},{"$nulls":9},"anchors not at the loaded span",{"$nulls":4},"PATROL + VERTICALE/ORIZZONTALE + SPEAR",null,"[4UTENTI]",{"$nulls":3},"TOWER",15,16.5,3.26,4,null,"TOWER",{"$f":"U106","v":2},{"$f":"V106","v":8.2},{"$f":"W106","v":1.26},4,{"$nulls":5},6,8,10,12]
[{"$nulls":15},"corner anchors",{"$nulls":4},"CAMPATA (M)","FORZA MASSIMA AL TERMINALE (KN)","FRECCIA CENTRO CAMPATA (M)",{"$nulls":3},"SHIELD",7.5,17.1,1.44,2,null,"SHIELD",{"$f":"U110","v":2},{"$f":"V110","v":12.5},{"$f":"W110","v":0.62},2,null,null,2,1.26,null,{"$f":"_xlfn.FORECAST.LINEAR(AQ111,$AO$112:$AO$113,$AN$112:$AN$113)","v":1.610769230769231},{"$f":"_xlfn.FORECAST.LINEAR(AR111,$AO$112:$AO$113,$AN$112:$AN$113)","v":1.7861538461538462},{"$f":"_xlfn.FORECAST.LINEAR(AS111,$AO$112:$AO$113,$AN$112:$AN$113)","v":1.9615384615384617},{"$f":"_xlfn.FORECAST.LINEAR(AT111,$AO$112:$AO$113,$AN$112:$AN$113)","v":2.136923076923077}]
[null,"Span rope deflection with respect to joining end constraints",{"$nulls":18},7.5,18.1,1.3,{"$nulls":3},"WALL",7.5,18.1,1.3,4,null,"WALL",{"$f":"U114","v":2},{"$f":"V114","v":14.2},{"$f":"W114","v":0.55},4,null,null,15,2.4,null,{"$f":"AQ112-AQ106","v":0.06076923076923091},{"$f":"AR112-AR106","v":0.016153846153846185},{"$f":"AS112-AS106","v":-0.008461538461538298},{"$f":"AT112-AT106","v":-0.013076923076922764}]
[null,"Span",null,"Deflection [m]",null,{"$f":"S106&\" m for rope elongation already considered\"","v":{"$error":"#VALUE!"}},{"$nulls":14},2,14.2,0.55,{"$nulls":19},6,8,10,12]
[null,{"$f":"VLOOKUP(MATCH(MAX(E43:E96),E43:E96,0),B43:C96,1,FALSE)&\" - \"&VLOOKUP(MATCH(MAX(E43:E96),E43:E96,0),B43:C96,2,FALSE)","v":"5 - 6"},null,{"$f":"IF(E36<=D23,S99,S99+S104/1000)","v":""},{"$nulls":35},2,1.33,null,{"$f":"_xlfn.FORECAST.LINEAR(AQ114,$AO$115:$AO$118,$AN$115:$AN$118)","v":1.9238461538461538},{"$f":"_xlfn.FORECAST.LINEAR(AR114,$AO$115:$AO$118,$AN$115:$AN$118)","v":2.2207692307692306},{"$f":"_xlfn.FORECAST.LINEAR(AS114,$AO$115:$AO$118,$AN$115:$AN$118)","v":2.5176923076923075},{"$f":"_xlfn.FORECAST.LINEAR(AT114,$AO$115:$AO$118,$AN$115:$AN$118)","v":2.8146153846153847}]
[]
[{"$nulls":31},"usati nei calcoli di interpolazione"]
[{"$nulls":39},15,3.26,null,{"$f":"AQ115-AQ109","v":-0.17615384615384633},{"$f":"AR115-AR109","v":-0.1792307692307693},{"$f":"AS115-AS109","v":-0.1423076923076927},{"$f":"AT115-AT109","v":-0.08538461538461517}]
[{"$nulls":20},"PATROL + PATROLEND/PAREND + SPEAREVO",null,"[4UTENTI]"]
[{"$nulls":20},"CAMPATA (M)","FORZA MASSIMA AL TERMINALE (KN)","FRECCIA CENTRO CAMPATA (M)"]
[null,"NOTES",{"$nulls":18},15,14,3.4,{"$nulls":4},"CAMPATA (M)","FORZA MASSIMA AL TERMINALE (KN)","FRECCIA CENTRO CAMPATA (M)",{"$nulls":3},"CAMPATA (M)","FORZA MASSIMA AL TERMINALE (KN)","FRECCIA CENTRO CAMPATA (M)"]
[null,"Fixings and anchors must be the same in all anchor points.",{"$nulls":18},"PATROL + SHIELD + SPEAREVO",null,"[4UTENTI]",{"$nulls":3},"WALL",15,14,3.4,4,null,"WALL",2,5.7,1.35,4]
[null,"Before the construction, all calculation must be verified and approved by the responsible designer.",{"$nulls":18},"CAMPATA (M)","FORZA MASSIMA AL TERMINALE (KN)","FRECCIA CENTRO CAMPATA (M)",{"$nulls":3},"SHIELD",15,13.7,3.4,4,null,"SHIELD",2,5.7,1.35,4]
[null,"Mechanical resistance values and geometry refer to product certification.",{"$nulls":18},15,13.7,3.4]
[null,"Verification of anchoring systems resistance must be realized apart."]
[null,"All calculations must be verified and approved by the responsible designer prior to execution. The designer are responsible to verify, at each use, the conformity of the data to the regulations in force and to the project. The ultimate responsibility for choosing the appropriate product for a specific application lies with the designer."]
[null,"The results obtained in this sheet are of an indicative nature and should be considered as a technical-commercial service within the Rotho Blaas srl sales activity. The number and thickness of the inserts must be determined by the responsible designer who is required to check the accuracy of the results deriving from the processing of the data entered. Rotho Blaas srl does not guarantee compliance with current legislation and the design of the calculations made through this spreadsheet. In particular, following the amendment of the pertinent provisions such as, for example standards, approvals, etc. the program may become, in part or in whole, invalid. Rotho Blaas srl does not guarantee and will not be responsible for direct or indirect damages or consequences or other, in any way (warranty for defects, warranty for malfunction, product or legal responsibility, etc.). The User declares to use the spreadsheet as a professional with the obligation and responsibility to verify that the spreadsheet meets his specific needs."]
{"$rows_empty":64}
[{"$nulls":18},"ctrl-X"]
[{"$nulls":18},"Coordinate nodi deformata fune MULTICAMPATA"]
[{"$nulls":18},"Nodi","X [m]","Y [m]"]
[{"$nulls":18},"V_SX",{"v":0,"d":"0.00000"},{"v":0,"d":"0.00000"}]
[{"$nulls":18},"A",{"v":0.029999999329447746,"d":"0.03000"},{"v":0,"d":"0.00000"}]
[{"$nulls":18},"tend A",{"v":0.2849999964237213,"d":"0.28500"},{"v":0,"d":"0.00000"}]
[{"$nulls":18},"N0",{"v":0.4399999976158142,"d":"0.44000"},{"v":0,"d":"0.00000"},null,null,{"$f":"IF(AND(Y199=0,Z199=0), 1, 0)","v":0},{"$f":"IF(AND(T198=0,U198=0), 0,T195)","v":0},{"$f":"IF(AND(T198=0,U198=0), 0,U195)","v":0},"V_SX"]
[{"$nulls":18},"N1",{"v":7,"d":"7.00000"},{"v":0,"d":"0.00000"},null,null,{"$f":"IF(AND(Y200=0,Z200=0), 1, 0)","v":0},{"$f":"IF(AND(T199=0,U199=0),NA(),T196)","v":0.029999999329447746},{"$f":"IF(AND(T199=0,U199=0), NA(),U196)","v":0},"A"]
[{"$nulls":18},"N2",{"v":7,"d":"7.00000"},{"v":-7,"d":"-7.00000"},null,null,0,{"$f":"IF(AND(T200=0,U200=0),NA(),T197)","v":0.2849999964237213},{"$f":"IF(AND(T200=0,U200=0), NA(),U197)","v":0},"tend A"]
[{"$nulls":18},"N3",{"v":-5.197000026702881,"d":"-5.19700"},{"v":-7,"d":"-7.00000"},null,null,0,0.4399999976158142,0,"N0"]
[{"$nulls":18},"N4",{"v":-17.393999099731445,"d":"-17.39400"},{"v":-7,"d":"-7.00000"},null,null,0,7,0,"N1"]
[{"$nulls":18},"N5",{"v":-20.54400062561035,"d":"-20.54400"},{"v":0.5,"d":"0.50000"},null,null,0,7,-7,"N2"]
[{"$nulls":18},"N6",{"v":-17.393999099731445,"d":"-17.39400"},{"v":8,"d":"8.00000"},null,null,0,-5.197000026702881,-7,"N3"]
[{"$nulls":18},"N7",{"v":-11.399999618530273,"d":"-11.40000"},{"v":8,"d":"8.00000"},null,null,0,-17.393999099731445,-7,"N4"]
[{"$nulls":18},"N8",{"v":-11.399999618530273,"d":"-11.40000"},{"v":2.180000066757202,"d":"2.18000"},null,null,0,-20.54400062561035,0.5,"N5"]
[{"$nulls":18},"N9",{"v":-11.399999618530273,"d":"-11.40000"},{"v":2.5899999141693115,"d":"2.59000"},null,null,0,-17.393999099731445,8,"N6"]
[{"$nulls":18},"N10",{"v":-11.399999618530273,"d":"-11.40000"},{"v":2.434999942779541,"d":"2.43500"},null,null,{"$error":"#N/A"},-11.399999618530273,8,"N7",14.401000022888184,-0.5799999833106995]
[{"$nulls":18},"N11",{"$nulls":4},{"$error":"#N/A"},{"$error":"#N/A"},{"$error":"#N/A"},"N8",15,0]
[{"$nulls":18},"N12",{"$nulls":4},{"$error":"#N/A"},{"$error":"#N/A"},{"$error":"#N/A"},"N9",4.5,0.2840000092983246]
[{"$nulls":18},"N13",{"$nulls":4},{"$error":"#N/A"},{"$error":"#N/A"},{"$error":"#N/A"},"N10",4.5,0.028999999165534973]
[{"$nulls":18},"N14",{"$nulls":4},{"$error":"#N/A"},{"$error":"#N/A"},{"$error":"#N/A"},"N11",4.5,0]
[{"$nulls":18},"N15",{"$nulls":4},{"$error":"#N/A"},{"$error":"#N/A"},{"$error":"#N/A"},"N12",-15.38700008392334,41.19900131225586]
[{"$nulls":18},"N16",{"$nulls":4},{"$error":"#N/A"},{"$error":"#N/A"},{"$error":"#N/A"},"N13",-11.399999618530273,2.434999942779541]
[{"$nulls":18},"N17",{"$nulls":4},{"$error":"#N/A"},{"$error":"#N/A"},{"$error":"#N/A"},"N14",-11.399999618530273,2.180000066757202]
[{"$nulls":18},"N18",{"$nulls":4},{"$error":"#N/A"},{"$error":"#N/A"},{"$error":"#N/A"},"N15",-11.399999618530273,2.1500000953674316]
[{"$nulls":18},"N19",{"v":0,"d":"0.00000"},{"v":0,"d":"0.00000"},null,null,{"$error":"#N/A"},{"$error":"#N/A"},{"$error":"#N/A"},"N16",0,-0.2840000092983246]
[{"$nulls":18},"N20",{"v":0,"d":"0.00000"},{"v":0,"d":"0.00000"},null,null,{"$error":"#N/A"},{"$error":"#N/A"},{"$error":"#N/A"},"N17",0,-0.028999999165534973,"N_last point"]
[{"$nulls":18},"N21",{"v":0,"d":"0.00000"},{"v":0,"d":"0.00000"},null,null,{"$error":"#N/A"},{"$error":"#N/A"},{"$error":"#N/A"},"N18",0,0,"tend B"]
[{"$nulls":18},"N22",{"v":0,"d":"0.00000"},{"v":0,"d":"0.00000"},null,null,{"$error":"#N/A"},{"$error":"#N/A"},{"$error":"#N/A"},"N19",-5.416999816894531,-10.241999626159668,"B"]
[{"$nulls":18},"N23",{"v":0,"d":"0.00000"},{"v":0,"d":"0.00000"},null,null,{"$f":"_xlfn.IFNA(1, IF(AND(Y222=0,Z222=0), 1, 0))","v":1},{"$error":"#N/A"},{"$error":"#N/A"},"N20",-5.420000076293945,-10.53499984741211,"V_DX"]
[{"$nulls":18},"N24",{"v":0,"d":"0.00000"},{"v":0,"d":"0.00000"},null,null,1,{"$error":"#N/A"},{"$error":"#N/A"},"N21"]
[{"$nulls":18},"N25",{"v":0,"d":"0.00000"},{"v":0,"d":"0.00000"},null,null,1,{"$error":"#N/A"},{"$error":"#N/A"},"N22"]
[{"$nulls":18},"N26",{"v":0,"d":"0.00000"},{"v":0,"d":"0.00000"},null,null,1,{"$error":"#N/A"},{"$error":"#N/A"},"N23"]
[{"$nulls":18},"N27",{"v":0,"d":"0.00000"},{"v":0,"d":"0.00000"},null,null,1,{"$error":"#N/A"},{"$error":"#N/A"},"N24"]
[{"$nulls":18},"N28",{"v":0,"d":"0.00000"},{"v":0,"d":"0.00000"},null,null,1,{"$error":"#N/A"},{"$error":"#N/A"},"N25"]
[{"$nulls":18},"N29",{"v":0,"d":"0.00000"},{"v":0,"d":"0.00000"},null,null,1,{"$error":"#N/A"},{"$error":"#N/A"},"N26"]
[{"$nulls":18},"N30",{"v":0,"d":"0.00000"},{"v":0,"d":"0.00000"},null,null,1,{"$error":"#N/A"},{"$error":"#N/A"},"N27"]
[{"$nulls":18},"N31",{"v":0,"d":"0.00000"},{"v":0,"d":"0.00000"},null,null,1,{"$error":"#N/A"},{"$error":"#N/A"},"N28"]
[{"$nulls":18},"N32",{"v":0,"d":"0.00000"},{"v":0,"d":"0.00000"},null,null,1,{"$error":"#N/A"},{"$error":"#N/A"},"N29"]
[{"$nulls":18},"N33",{"v":0,"d":"0.00000"},{"v":0,"d":"0.00000"},null,null,1,{"$error":"#N/A"},{"$error":"#N/A"},"N30"]
[{"$nulls":18},"N34",{"v":0,"d":"0.00000"},{"v":0,"d":"0.00000"},null,null,1,{"$error":"#N/A"},{"$error":"#N/A"},"N31"]
[{"$nulls":18},"N35",{"v":0,"d":"0.00000"},{"v":0,"d":"0.00000"},null,null,1,{"$error":"#N/A"},{"$error":"#N/A"},"N32"]
[{"$nulls":18},"N36",{"v":0,"d":"0.00000"},{"v":0,"d":"0.00000"},null,null,1,{"$error":"#N/A"},{"$error":"#N/A"},"N33"]
[{"$nulls":18},"N37",{"v":0,"d":"0.00000"},{"v":0,"d":"0.00000"},null,null,1,{"$error":"#N/A"},{"$error":"#N/A"},"N34"]
[{"$nulls":18},"N38",{"v":0,"d":"0.00000"},{"v":0,"d":"0.00000"},null,null,1,{"$error":"#N/A"},{"$error":"#N/A"},"N35"]
[{"$nulls":18},"N39",{"v":0,"d":"0.00000"},{"v":0,"d":"0.00000"},null,null,1,{"$error":"#N/A"},{"$error":"#N/A"},"N36"]
[{"$nulls":18},"N40",{"v":0,"d":"0.00000"},{"v":0,"d":"0.00000"},null,null,1,{"$error":"#N/A"},{"$error":"#N/A"},"N37"]
[{"$nulls":18},"N41",{"v":0,"d":"0.00000"},{"v":0,"d":"0.00000"},null,null,1,{"$error":"#N/A"},{"$error":"#N/A"},"N38"]
[{"$nulls":18},"N42",{"v":0,"d":"0.00000"},{"v":0,"d":"0.00000"},null,null,1,{"$error":"#N/A"},{"$error":"#N/A"},"N39"]
[{"$nulls":18},"N43",{"v":0,"d":"0.00000"},{"v":0,"d":"0.00000"},null,null,1,{"$error":"#N/A"},{"$error":"#N/A"},"N40"]
[{"$nulls":18},"N44",{"v":0,"d":"0.00000"},{"v":0,"d":"0.00000"},null,null,1,{"$error":"#N/A"},{"$error":"#N/A"},"N41"]
[{"$nulls":18},"N45",{"v":0,"d":"0.00000"},{"v":0,"d":"0.00000"},null,null,1,{"$error":"#N/A"},{"$error":"#N/A"},"N42"]
[{"$nulls":18},"N46",{"v":0,"d":"0.00000"},{"v":0,"d":"0.00000"},null,null,1,{"$error":"#N/A"},{"$error":"#N/A"},"N43"]
[{"$nulls":18},"N47",{"v":0,"d":"0.00000"},{"v":0,"d":"0.00000"},null,null,1,{"$error":"#N/A"},{"$error":"#N/A"},"N44"]
[{"$nulls":18},"N48",{"v":0,"d":"0.00000"},{"v":0,"d":"0.00000"},null,null,1,{"$error":"#N/A"},{"$error":"#N/A"},"N45"]
[{"$nulls":18},"N49",{"v":0,"d":"0.00000"},{"v":0,"d":"0.00000"},null,null,1,{"$error":"#N/A"},{"$error":"#N/A"},"N46"]
[{"$nulls":18},"N50",{"v":0,"d":"0.00000"},{"v":0,"d":"0.00000"},null,null,1,{"$error":"#N/A"},{"$error":"#N/A"},"N47"]
[{"$nulls":18},"N51",{"v":0,"d":"0.00000"},{"v":0,"d":"0.00000"},null,null,1,{"$error":"#N/A"},{"$error":"#N/A"},"N48"]
[{"$nulls":18},"N52",{"v":0,"d":"0.00000"},{"v":0,"d":"0.00000"},null,null,1,{"$error":"#N/A"},{"$error":"#N/A"},"N49"]
[{"$nulls":18},"N53",{"v":0,"d":"0.00000"},{"v":0,"d":"0.00000"},null,null,1,{"$error":"#N/A"},{"$error":"#N/A"},"N50"]
[{"$nulls":18},"N54",{"v":0,"d":"0.00000"},{"v":0,"d":"0.00000"},null,null,1,{"$error":"#N/A"},{"$error":"#N/A"},"N51"]
[{"$nulls":18},"N55",{"v":0,"d":"0.00000"},{"v":0,"d":"0.00000"},null,null,1,{"$error":"#N/A"},{"$error":"#N/A"},"N52"]
[{"$nulls":18},"N56",{"v":0,"d":"0.00000"},{"v":0,"d":"0.00000"},null,null,1,{"$error":"#N/A"},{"$error":"#N/A"},"N53"]
[{"$nulls":18},"N57",{"v":0,"d":"0.00000"},{"v":0,"d":"0.00000"},null,null,1,{"$error":"#N/A"},{"$error":"#N/A"},"N54"]
[{"$nulls":18},"tend B",{"v":0,"d":"0.00000"},{"v":0,"d":"0.00000"},null,null,1,{"$error":"#N/A"},{"$error":"#N/A"},"N55"]
[{"$nulls":18},"B",{"v":0,"d":"0.00000"},{"v":0,"d":"0.00000"},null,null,1,{"$error":"#N/A"},{"$error":"#N/A"},"N56"]
[{"$nulls":18},"V_DX",{"v":0,"d":"0.00000"},{"v":0,"d":"0.00000"},null,null,1,{"$error":"#N/A"},{"$error":"#N/A"},"N57"]
{"$rows_empty":23}
[null,{"$f":"+\"Posizione Supporto 1\"","v":"Posizione Supporto 1"}]
[null,null,{"$f":"+IF(E34=\"\",0,E34)","v":0},{"$f":"+IF(F34=\"\",0,F34)","v":0}]
[{"$nulls":15},"x","Y",null,null,"x/4","Y/4"]
[null,"Supporti Principali",{"$nulls":8},"interasse",{"$nulls":3},"Min",{"$f":"+MIN(G289:G365)-1","v":{"v":-1,"d":"-1.00"}},{"$f":"(MIN(H289:H365))-1","v":{"v":-6,"d":"-6.00"}},{"$f":"+Q285*Q288","v":-9},null,{"$f":"P285/4","v":-0.25},{"$f":"R285/4","v":-2.25}]
[null,{"$f":"+MAX(B289:B344,B345:B365)","v":6},null,"aggiornare formule se inserisco tramite coordinate",{"$nulls":6},15,{"$nulls":3},"Max",{"$f":"+MAX(G289:G365)+1","v":{"v":17,"d":"17.00"}},{"$f":"+MAX(H289:H365)+1","v":{"v":6,"d":"6.00"}},{"$f":"+Q286*Q288","v":9},null,{"$f":"P286/4","v":4.25},{"$f":"R286/4","v":2.25}]
[null,"Supporto",{"$nulls":10},"Somma Int",null,null,{"$f":"+P286-P285","v":{"v":18,"d":"18.00"}},{"$f":"+Q286-Q285","v":{"v":12,"d":"12.00"}}]
[null,"Partenza",null,"Lunghezza","Angolo(°)","Misura","X","Y",{"$nulls":4},{"$f":"+SUM(M290:M344)","v":0},{"$nulls":3},{"$f":"+P287/Q287","v":1.5},{"$nulls":36},"Fmax interpolazione","Fx","Fy","Ftot",null,"PUNTO DI ANGOLO","carico punti spigolosi","F1","F2"]
[null,1,"Direzione",null,0,{"$f":"+IF(C289=\"Loop\",SQRT((G289-G288)^2+(H289-H288)^2),0)","v":{"v":0,"d":"0.00"}},{"$f":"+C283","v":{"v":0,"d":"0.00"}},{"$f":"+D283","v":{"v":0,"d":"0.00"}},"Sen","Cos","Intermedi","Inter. Loop","Intermedi","Distanza Int","ANCORAGGIO","DISSIPATORE","nome curva CC","nome curva CC",{"$nulls":35},"kN","kN","kN","kN",null,"[]","kn","kn","kn"]
[null,{"$f":"IF(OR(J43=0,AND(K43=\"\",L43=\"\")), +IF(C290=\"Loop\",$B$289,IF(C290<>\"\",B289+1,\"\")),J43)","v":2},{"$f":"IF(D43=\"\",\"\",D43)","v":">"},{"$f":"IF(E43=\"\",0,E43)","v":{"v":10,"d":"10.00"}},{"$f":"IF(C290=\">\",0,IF(C290=\"<\",180,IF(C290=\"V\",270,IF(C290=\"Λ\",90,F43))))","v":0},{"v":0,"d":"0.00"},{"$f":"IF(K43=\"\", _xlfn.IFS($C290=\"Angle\",(D290*I290)+G289,$C290=\"Loop\",$G$289,$C290=\"\",G289,$C290=\"End\",G289,$C290=\">\",G289+D290,$C290=\"<\",G289-D290,OR($C290=\"Λ\",$C290=\"V\"),G289), K43)","v":{"v":10,"d":"10.00"}},{"$f":"IF(L43=\"\",_xlfn.IFS($C290=\"Angle\",(D290*J290)+H289,$C290=\"Loop\",$H$289,$C290=\"\",H289,$C290=\"End\",H289,$C290=\"Λ\",H289+D290,$C290=\"V\",H289-D290,OR($C290=\"<\",$C290=\">\"),H289),L43)","v":{"v":0,"d":"0.00"}},{"$f":"+COS(RADIANS(E290))","v":{"v":1,"d":"1.0000"}},{"$f":"SIN(RADIANS(E290))","v":{"v":0,"d":"0.0000"}},{"$f":"+IF(OR(D290=0,D290=\"\"),\"\",IF(MOD(D290,$K$286),_xlfn.FLOOR.MATH(D290/$K$286),_xlfn.FLOOR.MATH(D290/$K$286)-1))","v":0},{"$f":"+IF(OR(F290=0,F290=\"\"),\"\",IF(MOD(F290,$K$286),_xlfn.FLOOR.MATH(F290/$K$286),_xlfn.FLOOR.MATH(F290/$K$286)-1))","v":""},{"$f":"+MAX(K290:L290)","v":0},{"$f":"IF(AND(D290=0,F290=0),0,IF(D290<>0,D290/(M290+1),F290/(M290+1)))","v":{"v":10,"d":"10.00"}},{"$f":"IF(B290=\"\", O289, AH43)","v":"TOWER"},{"$f":"IF(B290=\"\", P289, AK43)","v":"SPEAR2/SPEAR"},{"$f":"VLOOKUP(O290,$AG$5:$AH$12,2,)","v":"TOWER600.txt"},{"$f":"VLOOKUP(P290,$W$5:$X$8,2,)","v":"SPEAR_SPEAR2.txt"},{"$nulls":35},{"$f":"IF(AND(C290=\"\",C291=\"\"),0,_xlfn.FORECAST.LINEAR($E$99,$F$23:$F$24,$D$23:$D$24))","v":{"$error":"#DIV/0!"}},{"$f":"BB290*(COS(RADIANS(E291))-COS(RADIANS(E290)))","v":{"$error":"#DIV/0!"}},{"$f":"BB290*(SIN(RADIANS(E291))-SIN(RADIANS(E290)))","v":{"$error":"#DIV/0!"}},{"$f":"IF(AND(C290=\"\",C291=\"\"),0,IF(C291=\"\",BB290,IF(SQRT(BC290^2+BD290^2)>BB290*SQRT(2),BB290*SQRT(2),SQRT(BC290^2+BD290^2))))","v":{"$error":"#DIV/0!"}},null,{"$f":"IF(C291=\"\",0,IF(OR(AND(G290-G289=0,G291-G290=0),AND(H290-H289=0,H291-H290=0)),0,1))","v":1},{"$f":"IF(BG290=1,BE290,0)","v":{"$error":"#DIV/0!"}},{"$f":"IF(BH290=0,0,IF(SQRT(BC290^2+BD290^2)>BB290*SQRT(2),BB290,BC290))","v":{"$error":"#DIV/0!"}},{"$f":"IF(BH290=0,0,IF(SQRT(BC290^2+BD290^2)>BB290*SQRT(2),BB290,BD290))","v":{"$error":"#DIV/0!"}}]
[null,3,"Λ",{"v":5,"d":"5.00"},{"$f":"IF(C291=\">\",0,IF(C291=\"<\",180,IF(C291=\"V\",270,IF(C291=\"Λ\",90,F44))))","v":90},{"v":0,"d":"0.00"},{"$f":"IF(K44=\"\", _xlfn.IFS($C291=\"Angle\",(D291*I291)+G290,$C291=\"Loop\",$G$289,$C291=\"\",G290,$C291=\"End\",G290,$C291=\">\",G290+D291,$C291=\"<\",G290-D291,OR($C291=\"Λ\",$C291=\"V\"),G290), K44)","v":{"v":10,"d":"10.00"}},{"$f":"IF(L44=\"\",_xlfn.IFS($C291=\"Angle\",(D291*J291)+H290,$C291=\"Loop\",$H$289,$C291=\"\",H290,$C291=\"End\",H290,$C291=\"Λ\",H290+D291,$C291=\"V\",H290-D291,OR($C291=\"<\",$C291=\">\"),H290),L44)","v":{"v":5,"d":"5.00"}},{"v":6.1257422745431e-17,"d":"0.0000"},{"v":1,"d":"1.0000"},0,"",{"$f":"+MAX(K291:L291)","v":0},{"$f":"IF(AND(D291=0,F291=0),0,IF(D291<>0,D291/(M291+1),F291/(M291+1)))","v":{"v":5,"d":"5.00"}},"TOWER",null,"TOWER600.txt",{"$nulls":36},{"$error":"#DIV/0!"},{"$f":"BB291*(COS(RADIANS(E292))-COS(RADIANS(E291)))","v":{"$error":"#DIV/0!"}},{"$f":"BB291*(SIN(RADIANS(E292))-SIN(RADIANS(E291)))","v":{"$error":"#DIV/0!"}},{"$f":"IF(AND(C291=\"\",C292=\"\"),0,IF(C292=\"\",BB291,IF(SQRT(BC291^2+BD291^2)>BB291*SQRT(2),BB291*SQRT(2),SQRT(BC291^2+BD291^2))))","v":{"$error":"#DIV/0!"}},null,{"$f":"IF(C292=\"\",0,IF(OR(AND(G291-G290=0,G292-G291=0),AND(H291-H290=0,H292-H291=0)),0,1))","v":1},{"$f":"IF(BG291=1,BE291,0)","v":{"$error":"#DIV/0!"}},{"$f":"IF(BH291=0,0,IF(SQRT(BC291^2+BD291^2)>BB291*SQRT(2),BB291,BC291))","v":{"$error":"#DIV/0!"}},{"$f":"IF(BH291=0,0,IF(SQRT(BC291^2+BD291^2)>BB291*SQRT(2),BB291,BD291))","v":{"$error":"#DIV/0!"}}]
[null,4,">",{"v":6,"d":"6.00"},0,{"v":0,"d":"0.00"},{"$f":"IF(K45=\"\", _xlfn.IFS($C292=\"Angle\",(D292*I292)+G291,$C292=\"Loop\",$G$289,$C292=\"\",G291,$C292=\"End\",G291,$C292=\">\",G291+D292,$C292=\"<\",G291-D292,OR($C292=\"Λ\",$C292=\"V\"),G291), K45)","v":{"v":16,"d":"16.00"}},{"$f":"IF(L45=\"\",_xlfn.IFS($C292=\"Angle\",(D292*J292)+H291,$C292=\"Loop\",$H$289,$C292=\"\",H291,$C292=\"End\",H291,$C292=\"Λ\",H291+D292,$C292=\"V\",H291-D292,OR($C292=\"<\",$C292=\">\"),H291),L45)","v":{"v":5,"d":"5.00"}},{"v":1,"d":"1.0000"},{"v":0,"d":"0.0000"},0,"",0,{"v":6,"d":"6.00"},"TOWER",null,"TOWER600.txt",{"$nulls":36},{"$error":"#DIV/0!"},{"$error":"#DIV/0!"},{"$error":"#DIV/0!"},{"$error":"#DIV/0!"},null,1,{"$error":"#DIV/0!"},{"$error":"#DIV/0!"},{"$error":"#DIV/0!"}]
[null,5,"V",{"v":10,"d":"10.00"},270,{"v":0,"d":"0.00"},{"$f":"IF(K46=\"\", _xlfn.IFS($C293=\"Angle\",(D293*I293)+G292,$C293=\"Loop\",$G$289,$C293=\"\",G292,$C293=\"End\",G292,$C293=\">\",G292+D293,$C293=\"<\",G292-D293,OR($C293=\"Λ\",$C293=\"V\"),G292), K46)","v":{"v":16,"d":"16.00"}},{"$f":"IF(L46=\"\",_xlfn.IFS($C293=\"Angle\",(D293*J293)+H292,$C293=\"Loop\",$H$289,$C293=\"\",H292,$C293=\"End\",H292,$C293=\"Λ\",H292+D293,$C293=\"V\",H292-D293,OR($C293=\"<\",$C293=\">\"),H292),L46)","v":{"v":-5,"d":"-5.00"}},{"v":-1.83772268236293E-16,"d":"-0.0000"},{"v":-1,"d":"-1.0000"},0,"",0,{"v":10,"d":"10.00"},"TOWER",null,"TOWER600.txt",{"$nulls":36},{"$error":"#DIV/0!"},{"$error":"#DIV/0!"},{"$error":"#DIV/0!"},{"$error":"#DIV/0!"},null,1,{"$error":"#DIV/0!"},{"$error":"#DIV/0!"},{"$error":"#DIV/0!"}]
[null,6,"<",{"v":12.5,"d":"12.50"},180,{"v":0,"d":"0.00"},{"$f":"IF(K47=\"\", _xlfn.IFS($C294=\"Angle\",(D294*I294)+G293,$C294=\"Loop\",$G$289,$C294=\"\",G293,$C294=\"End\",G293,$C294=\">\",G293+D294,$C294=\"<\",G293-D294,OR($C294=\"Λ\",$C294=\"V\"),G293), K47)","v":{"v":3.5,"d":"3.50"}},{"$f":"IF(L47=\"\",_xlfn.IFS($C294=\"Angle\",(D294*J294)+H293,$C294=\"Loop\",$H$289,$C294=\"\",H293,$C294=\"End\",H293,$C294=\"Λ\",H293+D294,$C294=\"V\",H293-D294,OR($C294=\"<\",$C294=\">\"),H293),L47)","v":{"v":-5,"d":"-5.00"}},{"v":-1,"d":"-1.0000"},{"v":1.22514845490862E-16,"d":"0.0000"},0,"",0,{"v":12.5,"d":"12.50"},"TOWER",null,"TOWER600.txt",{"$nulls":36},{"$error":"#DIV/0!"},{"$error":"#DIV/0!"},{"$error":"#DIV/0!"},{"$error":"#DIV/0!"},null,0,0,0,0]
[null,"","",{"v":0,"d":"0.00"},0,{"v":0,"d":"0.00"},{"$f":"IF(K48=\"\", _xlfn.IFS($C295=\"Angle\",(D295*I295)+G294,$C295=\"Loop\",$G$289,$C295=\"\",G294,$C295=\"End\",G294,$C295=\">\",G294+D295,$C295=\"<\",G294-D295,OR($C295=\"Λ\",$C295=\"V\"),G294), K48)","v":{"v":3.5,"d":"3.50"}},{"$f":"IF(L48=\"\",_xlfn.IFS($C295=\"Angle\",(D295*J295)+H294,$C295=\"Loop\",$H$289,$C295=\"\",H294,$C295=\"End\",H294,$C295=\"Λ\",H294+D295,$C295=\"V\",H294-D295,OR($C295=\"<\",$C295=\">\"),H294),L48)","v":{"v":-5,"d":"-5.00"}},{"v":1,"d":"1.0000"},{"v":0,"d":"0.0000"},"","",0,{"v":0,"d":"0.00"},"TOWER",null,"TOWER600.txt",{"$nulls":36},{"v":0,"d":"0.0"},{"v":0,"d":"0.0"},{"v":0,"d":"0.0"},{"v":0,"d":"0.0"},null,0,0,0,0]
[null,"","",{"v":0,"d":"0.00"},0,{"v":0,"d":"0.00"},{"$f":"IF(K49=\"\", _xlfn.IFS($C296=\"Angle\",(D296*I296)+G295,$C296=\"Loop\",$G$289,$C296=\"\",G295,$C296=\"End\",G295,$C296=\">\",G295+D296,$C296=\"<\",G295-D296,OR($C296=\"Λ\",$C296=\"V\"),G295), K49)","v":{"v":3.5,"d":"3.50"}},{"$f":"IF(L49=\"\",_xlfn.IFS($C296=\"Angle\",(D296*J296)+H295,$C296=\"Loop\",$H$289,$C296=\"\",H295,$C296=\"End\",H295,$C296=\"Λ\",H295+D296,$C296=\"V\",H295-D296,OR($C296=\"<\",$C296=\">\"),H295),L49)","v":{"v":-5,"d":"-5.00"}},{"v":1,"d":"1.0000"},{"v":0,"d":"0.0000"},"","",0,{"v":0,"d":"0.00"},"TOWER",null,"TOWER600.txt",{"$nulls":36},{"v":0,"d":"0.0"},{"v":0,"d":"0.0"},{"v":0,"d":"0.0"},{"v":0,"d":"0.0"},null,0,0,0,0]
[null,"","",{"v":0,"d":"0.00"},0,{"v":0,"d":"0.00"},{"$f":"IF(K50=\"\", _xlfn.IFS($C297=\"Angle\",(D297*I297)+G296,$C297=\"Loop\",$G$289,$C297=\"\",G296,$C297=\"End\",G296,$C297=\">\",G296+D297,$C297=\"<\",G296-D297,OR($C297=\"Λ\",$C297=\"V\"),G296), K50)","v":{"v":3.5,"d":"3.50"}},{"$f":"IF(L50=\"\",_xlfn.IFS($C297=\"Angle\",(D297*J297)+H296,$C297=\"Loop\",$H$289,$C297=\"\",H296,$C297=\"End\",H296,$C297=\"Λ\",H296+D297,$C297=\"V\",H296-D297,OR($C297=\"<\",$C297=\">\"),H296),L50)","v":{"v":-5,"d":"-5.00"}},{"v":1,"d":"1.0000"},{"v":0,"d":"0.0000"},"","",0,{"v":0,"d":"0.00"},"TOWER",null,"TOWER600.txt",{"$nulls":36},{"v":0,"d":"0.0"},{"v":0,"d":"0.0"},{"v":0,"d":"0.0"},{"v":0,"d":"0.0"},null,0,0,0,0]
[null,"","",{"v":0,"d":"0.00"},{"$f":"+IF(F51=\"\",0,F51)","v":0},{"v":0,"d":"0.00"},{"$f":"IF(K51=\"\", _xlfn.IFS($C298=\"Angle\",(D298*I298)+G297,$C298=\"Loop\",$G$289,$C298=\"\",G297,$C298=\"End\",G297,$C298=\">\",G297+D298,$C298=\"<\",G297-D298,OR($C298=\"Λ\",$C298=\"V\"),G297), K51)","v":{"v":3.5,"d":"3.50"}},{"$f":"IF(L51=\"\",_xlfn.IFS($C298=\"Angle\",(D298*J298)+H297,$C298=\"Loop\",$H$289,$C298=\"\",H297,$C298=\"End\",H297,$C298=\"Λ\",H297+D298,$C298=\"V\",H297-D298,OR($C298=\"<\",$C298=\">\"),H297),L51)","v":{"v":-5,"d":"-5.00"}},{"v":1,"d":"1.0000"},{"v":0,"d":"0.0000"},"","",0,{"v":0,"d":"0.00"},"TOWER",null,"TOWER600.txt",{"$nulls":36},{"v":0,"d":"0.0"},{"v":0,"d":"0.0"},{"v":0,"d":"0.0"},{"v":0,"d":"0.0"},null,0,0,0,0]
[null,"","",{"v":0,"d":"0.00"},0,{"v":0,"d":"0.00"},{"$f":"IF(K52=\"\", _xlfn.IFS($C299=\"Angle\",(D299*I299)+G298,$C299=\"Loop\",$G$289,$C299=\"\",G298,$C299=\"End\",G298,$C299=\">\",G298+D299,$C299=\"<\",G298-D299,OR($C299=\"Λ\",$C299=\"V\"),G298), K52)","v":{"v":3.5,"d":"3.50"}},{"$f":"IF(L52=\"\",_xlfn.IFS($C299=\"Angle\",(D299*J299)+H298,$C299=\"Loop\",$H$289,$C299=\"\",H298,$C299=\"End\",H298,$C299=\"Λ\",H298+D299,$C299=\"V\",H298-D299,OR($C299=\"<\",$C299=\">\"),H298),L52)","v":{"v":-5,"d":"-5.00"}},{"v":1,"d":"1.0000"},{"v":0,"d":"0.0000"},"","",0,{"v":0,"d":"0.00"},"TOWER",null,"TOWER600.txt",{"$nulls":36},{"v":0,"d":"0.0"},{"v":0,"d":"0.0"},{"v":0,"d":"0.0"},{"v":0,"d":"0.0"},null,0,0,0,0]
[null,"","",{"v":0,"d":"0.00"},0,{"v":0,"d":"0.00"},{"$f":"IF(K53=\"\", _xlfn.IFS($C300=\"Angle\",(D300*I300)+G299,$C300=\"Loop\",$G$289,$C300=\"\",G299,$C300=\"End\",G299,$C300=\">\",G299+D300,$C300=\"<\",G299-D300,OR($C300=\"Λ\",$C300=\"V\"),G299), K53)","v":{"v":3.5,"d":"3.50"}},{"$f":"IF(L53=\"\",_xlfn.IFS($C300=\"Angle\",(D300*J300)+H299,$C300=\"Loop\",$H$289,$C300=\"\",H299,$C300=\"End\",H299,$C300=\"Λ\",H299+D300,$C300=\"V\",H299-D300,OR($C300=\"<\",$C300=\">\"),H299),L53)","v":{"v":-5,"d":"-5.00"}},{"v":1,"d":"1.0000"},{"v":0,"d":"0.0000"},"","",0,{"v":0,"d":"0.00"},"TOWER",null,"TOWER600.txt",{"$nulls":36},{"v":0,"d":"0.0"},{"v":0,"d":"0.0"},{"v":0,"d":"0.0"},{"v":0,"d":"0.0"},null,0,0,0,0]
[null,"","",{"v":0,"d":"0.00"},0,{"v":0,"d":"0.00"},{"$f":"IF(K54=\"\", _xlfn.IFS($C301=\"Angle\",(D301*I301)+G300,$C301=\"Loop\",$G$289,$C301=\"\",G300,$C301=\"End\",G300,$C301=\">\",G300+D301,$C301=\"<\",G300-D301,OR($C301=\"Λ\",$C301=\"V\"),G300), K54)","v":{"v":3.5,"d":"3.50"}},{"$f":"IF(L54=\"\",_xlfn.IFS($C301=\"Angle\",(D301*J301)+H300,$C301=\"Loop\",$H$289,$C301=\"\",H300,$C301=\"End\",H300,$C301=\"Λ\",H300+D301,$C301=\"V\",H300-D301,OR($C301=\"<\",$C301=\">\"),H300),L54)","v":{"v":-5,"d":"-5.00"}},{"v":1,"d":"1.0000"},{"v":0,"d":"0.0000"},"","",0,{"v":0,"d":"0.00"},"TOWER",null,"TOWER600.txt",{"$nulls":36},{"v":0,"d":"0.0"},{"v":0,"d":"0.0"},{"v":0,"d":"0.0"},{"v":0,"d":"0.0"},null,0,0,0,0]
[null,"","",{"v":0,"d":"0.00"},0,{"v":0,"d":"0.00"},{"$f":"IF(K55=\"\", _xlfn.IFS($C302=\"Angle\",(D302*I302)+G301,$C302=\"Loop\",$G$289,$C302=\"\",G301,$C302=\"End\",G301,$C302=\">\",G301+D302,$C302=\"<\",G301-D302,OR($C302=\"Λ\",$C302=\"V\"),G301), K55)","v":{"v":3.5,"d":"3.50"}},{"$f":"IF(L55=\"\",_xlfn.IFS($C302=\"Angle\",(D302*J302)+H301,$C302=\"Loop\",$H$289,$C302=\"\",H301,$C302=\"End\",H301,$C302=\"Λ\",H301+D302,$C302=\"V\",H301-D302,OR($C302=\"<\",$C302=\">\"),H301),L55)","v":{"v":-5,"d":"-5.00"}},{"v":1,"d":"1.0000"},{"v":0,"d":"0.0000"},"","",0,{"v":0,"d":"0.00"},"TOWER",null,"TOWER600.txt",{"$nulls":36},{"v":0,"d":"0.0"},{"v":0,"d":"0.0"},{"v":0,"d":"0.0"},{"v":0,"d":"0.0"},null,0,0,0,0]
[null,"","",{"v":0,"d":"0.00"},0,{"v":0,"d":"0.00"},{"$f":"IF(K56=\"\", _xlfn.IFS($C303=\"Angle\",(D303*I303)+G302,$C303=\"Loop\",$G$289,$C303=\"\",G302,$C303=\"End\",G302,$C303=\">\",G302+D303,$C303=\"<\",G302-D303,OR($C303=\"Λ\",$C303=\"V\"),G302), K56)","v":{"v":3.5,"d":"3.50"}},{"$f":"IF(L56=\"\",_xlfn.IFS($C303=\"Angle\",(D303*J303)+H302,$C303=\"Loop\",$H$289,$C303=\"\",H302,$C303=\"End\",H302,$C303=\"Λ\",H302+D303,$C303=\"V\",H302-D303,OR($C303=\"<\",$C303=\">\"),H302),L56)","v":{"v":-5,"d":"-5.00"}},{"v":1,"d":"1.0000"},{"v":0,"d":"0.0000"},"","",0,{"v":0,"d":"0.00"},"TOWER",null,"TOWER600.txt",{"$nulls":36},{"v":0,"d":"0.0"},{"v":0,"d":"0.0"},{"v":0,"d":"0.0"},{"v":0,"d":"0.0"},null,0,0,0,0]
[null,"","",{"v":0,"d":"0.00"},0,{"v":0,"d":"0.00"},{"$f":"IF(K57=\"\", _xlfn.IFS($C304=\"Angle\",(D304*I304)+G303,$C304=\"Loop\",$G$289,$C304=\"\",G303,$C304=\"End\",G303,$C304=\">\",G303+D304,$C304=\"<\",G303-D304,OR($C304=\"Λ\",$C304=\"V\"),G303), K57)","v":{"v":3.5,"d":"3.50"}},{"$f":"IF(L57=\"\",_xlfn.IFS($C304=\"Angle\",(D304*J304)+H303,$C304=\"Loop\",$H$289,$C304=\"\",H303,$C304=\"End\",H303,$C304=\"Λ\",H303+D304,$C304=\"V\",H303-D304,OR($C304=\"<\",$C304=\">\"),H303),L57)","v":{"v":-5,"d":"-5.00"}},{"v":1,"d":"1.0000"},{"v":0,"d":"0.0000"},"","",0,{"v":0,"d":"0.00"},"TOWER",null,"TOWER600.txt",{"$nulls":36},{"v":0,"d":"0.0"},{"v":0,"d":"0.0"},{"v":0,"d":"0.0"},{"v":0,"d":"0.0"},null,0,0,0,0]
[null,"","",{"v":0,"d":"0.00"},0,{"v":0,"d":"0.00"},{"$f":"IF(K58=\"\", _xlfn.IFS($C305=\"Angle\",(D305*I305)+G304,$C305=\"Loop\",$G$289,$C305=\"\",G304,$C305=\"End\",G304,$C305=\">\",G304+D305,$C305=\"<\",G304-D305,OR($C305=\"Λ\",$C305=\"V\"),G304), K58)","v":{"v":3.5,"d":"3.50"}},{"$f":"IF(L58=\"\",_xlfn.IFS($C305=\"Angle\",(D305*J305)+H304,$C305=\"Loop\",$H$289,$C305=\"\",H304,$C305=\"End\",H304,$C305=\"Λ\",H304+D305,$C305=\"V\",H304-D305,OR($C305=\"<\",$C305=\">\"),H304),L58)","v":{"v":-5,"d":"-5.00"}},{"v":1,"d":"1.0000"},{"v":0,"d":"0.0000"},"","",0,{"v":0,"d":"0.00"},"TOWER",null,"TOWER600.txt",{"$nulls":36},{"v":0,"d":"0.0"},{"v":0,"d":"0.0"},{"v":0,"d":"0.0"},{"v":0,"d":"0.0"},null,0,0,0,0]
[null,"","",{"v":0,"d":"0.00"},0,{"v":0,"d":"0.00"},{"$f":"IF(K59=\"\", _xlfn.IFS($C306=\"Angle\",(D306*I306)+G305,$C306=\"Loop\",$G$289,$C306=\"\",G305,$C306=\"End\",G305,$C306=\">\",G305+D306,$C306=\"<\",G305-D306,OR($C306=\"Λ\",$C306=\"V\"),G305), K59)","v":{"v":3.5,"d":"3.50"}},{"$f":"IF(L59=\"\",_xlfn.IFS($C306=\"Angle\",(D306*J306)+H305,$C306=\"Loop\",$H$289,$C306=\"\",H305,$C306=\"End\",H305,$C306=\"Λ\",H305+D306,$C306=\"V\",H305-D306,OR($C306=\"<\",$C306=\">\"),H305),L59)","v":{"v":-5,"d":"-5.00"}},{"v":1,"d":"1.0000"},{"v":0,"d":"0.0000"},"","",0,{"v":0,"d":"0.00"},"TOWER",null,"TOWER600.txt",{"$nulls":36},{"v":0,"d":"0.0"},{"v":0,"d":"0.0"},{"v":0,"d":"0.0"},{"v":0,"d":"0.0"},null,0,0,0,0]
[null,"","",{"v":0,"d":"0.00"},0,{"v":0,"d":"0.00"},{"$f":"IF(K60=\"\", _xlfn.IFS($C307=\"Angle\",(D307*I307)+G306,$C307=\"Loop\",$G$289,$C307=\"\",G306,$C307=\"End\",G306,$C307=\">\",G306+D307,$C307=\"<\",G306-D307,OR($C307=\"Λ\",$C307=\"V\"),G306), K60)","v":{"v":3.5,"d":"3.50"}},{"$f":"IF(L60=\"\",_xlfn.IFS($C307=\"Angle\",(D307*J307)+H306,$C307=\"Loop\",$H$289,$C307=\"\",H306,$C307=\"End\",H306,$C307=\"Λ\",H306+D307,$C307=\"V\",H306-D307,OR($C307=\"<\",$C307=\">\"),H306),L60)","v":{"v":-5,"d":"-5.00"}},{"v":1,"d":"1.0000"},{"v":0,"d":"0.0000"},"","",0,{"v":0,"d":"0.00"},"TOWER",null,"TOWER600.txt",{"$nulls":36},{"v":0,"d":"0.0"},{"v":0,"d":"0.0"},{"v":0,"d":"0.0"},{"v":0,"d":"0.0"},null,0,0,0,0]
[null,"","",{"v":0,"d":"0.00"},0,{"v":0,"d":"0.00"},{"$f":"IF(K61=\"\", _xlfn.IFS($C308=\"Angle\",(D308*I308)+G307,$C308=\"Loop\",$G$289,$C308=\"\",G307,$C308=\"End\",G307,$C308=\">\",G307+D308,$C308=\"<\",G307-D308,OR($C308=\"Λ\",$C308=\"V\"),G307), K61)","v":{"v":3.5,"d":"3.50"}},{"$f":"IF(L61=\"\",_xlfn.IFS($C308=\"Angle\",(D308*J308)+H307,$C308=\"Loop\",$H$289,$C308=\"\",H307,$C308=\"End\",H307,$C308=\"Λ\",H307+D308,$C308=\"V\",H307-D308,OR($C308=\"<\",$C308=\">\"),H307),L61)","v":{"v":-5,"d":"-5.00"}},{"v":1,"d":"1.0000"},{"v":0,"d":"0.0000"},"","",0,{"v":0,"d":"0.00"},"TOWER",null,"TOWER600.txt",{"$nulls":36},{"v":0,"d":"0.0"},{"v":0,"d":"0.0"},{"v":0,"d":"0.0"},{"v":0,"d":"0.0"},null,0,0,0,0]
[null,"","",{"v":0,"d":"0.00"},0,{"v":0,"d":"0.00"},{"$f":"IF(K62=\"\", _xlfn.IFS($C309=\"Angle\",(D309*I309)+G308,$C309=\"Loop\",$G$289,$C309=\"\",G308,$C309=\"End\",G308,$C309=\">\",G308+D309,$C309=\"<\",G308-D309,OR($C309=\"Λ\",$C309=\"V\"),G308), K62)","v":{"v":3.5,"d":"3.50"}},{"$f":"IF(L62=\"\",_xlfn.IFS($C309=\"Angle\",(D309*J309)+H308,$C309=\"Loop\",$H$289,$C309=\"\",H308,$C309=\"End\",H308,$C309=\"Λ\",H308+D309,$C309=\"V\",H308-D309,OR($C309=\"<\",$C309=\">\"),H308),L62)","v":{"v":-5,"d":"-5.00"}},{"v":1,"d":"1.0000"},{"v":0,"d":"0.0000"},"","",0,{"v":0,"d":"0.00"},"TOWER",null,"TOWER600.txt",{"$nulls":36},{"v":0,"d":"0.0"},{"v":0,"d":"0.0"},{"v":0,"d":"0.0"},{"v":0,"d":"0.0"},null,0,0,0,0]
[null,"","",{"v":0,"d":"0.00"},0,{"v":0,"d":"0.00"},{"$f":"IF(K63=\"\", _xlfn.IFS($C310=\"Angle\",(D310*I310)+G309,$C310=\"Loop\",$G$289,$C310=\"\",G309,$C310=\"End\",G309,$C310=\">\",G309+D310,$C310=\"<\",G309-D310,OR($C310=\"Λ\",$C310=\"V\"),G309), K63)","v":{"v":3.5,"d":"3.50"}},{"$f":"IF(L63=\"\",_xlfn.IFS($C310=\"Angle\",(D310*J310)+H309,$C310=\"Loop\",$H$289,$C310=\"\",H309,$C310=\"End\",H309,$C310=\"Λ\",H309+D310,$C310=\"V\",H309-D310,OR($C310=\"<\",$C310=\">\"),H309),L63)","v":{"v":-5,"d":"-5.00"}},{"v":1,"d":"1.0000"},{"v":0,"d":"0.0000"},"","",0,{"v":0,"d":"0.00"},"TOWER",null,"TOWER600.txt",{"$nulls":36},{"v":0,"d":"0.0"},{"v":0,"d":"0.0"},{"v":0,"d":"0.0"},{"v":0,"d":"0.0"},null,0,0,0,0]
[null,"","",{"v":0,"d":"0.00"},0,{"v":0,"d":"0.00"},{"$f":"IF(K64=\"\", _xlfn.IFS($C311=\"Angle\",(D311*I311)+G310,$C311=\"Loop\",$G$289,$C311=\"\",G310,$C311=\"End\",G310,$C311=\">\",G310+D311,$C311=\"<\",G310-D311,OR($C311=\"Λ\",$C311=\"V\"),G310), K64)","v":{"v":3.5,"d":"3.50"}},{"$f":"IF(L64=\"\",_xlfn.IFS($C311=\"Angle\",(D311*J311)+H310,$C311=\"Loop\",$H$289,$C311=\"\",H310,$C311=\"End\",H310,$C311=\"Λ\",H310+D311,$C311=\"V\",H310-D311,OR($C311=\"<\",$C311=\">\"),H310),L64)","v":{"v":-5,"d":"-5.00"}},{"v":1,"d":"1.0000"},{"v":0,"d":"0.0000"},"","",0,{"v":0,"d":"0.00"},"TOWER",null,"TOWER600.txt",{"$nulls":36},{"v":0,"d":"0.0"},{"v":0,"d":"0.0"},{"v":0,"d":"0.0"},{"v":0,"d":"0.0"},null,0,0,0,0]
[null,"","",{"v":0,"d":"0.00"},0,{"v":0,"d":"0.00"},{"$f":"IF(K65=\"\", _xlfn.IFS($C312=\"Angle\",(D312*I312)+G311,$C312=\"Loop\",$G$289,$C312=\"\",G311,$C312=\"End\",G311,$C312=\">\",G311+D312,$C312=\"<\",G311-D312,OR($C312=\"Λ\",$C312=\"V\"),G311), K65)","v":{"v":3.5,"d":"3.50"}},{"$f":"IF(L65=\"\",_xlfn.IFS($C312=\"Angle\",(D312*J312)+H311,$C312=\"Loop\",$H$289,$C312=\"\",H311,$C312=\"End\",H311,$C312=\"Λ\",H311+D312,$C312=\"V\",H311-D312,OR($C312=\"<\",$C312=\">\"),H311),L65)","v":{"v":-5,"d":"-5.00"}},{"v":1,"d":"1.0000"},{"v":0,"d":"0.0000"},"","",0,{"v":0,"d":"0.00"},"TOWER",null,"TOWER600.txt",{"$nulls":36},{"v":0,"d":"0.0"},{"v":0,"d":"0.0"},{"v":0,"d":"0.0"},{"v":0,"d":"0.0"},null,0,0,0,0]
[null,"","",{"v":0,"d":"0.00"},0,{"v":0,"d":"0.00"},{"$f":"IF(K66=\"\", _xlfn.IFS($C313=\"Angle\",(D313*I313)+G312,$C313=\"Loop\",$G$289,$C313=\"\",G312,$C313=\"End\",G312,$C313=\">\",G312+D313,$C313=\"<\",G312-D313,OR($C313=\"Λ\",$C313=\"V\"),G312), K66)","v":{"v":3.5,"d":"3.50"}},{"$f":"IF(L66=\"\",_xlfn.IFS($C313=\"Angle\",(D313*J313)+H312,$C313=\"Loop\",$H$289,$C313=\"\",H312,$C313=\"End\",H312,$C313=\"Λ\",H312+D313,$C313=\"V\",H312-D313,OR($C313=\"<\",$C313=\">\"),H312),L66)","v":{"v":-5,"d":"-5.00"}},{"v":1,"d":"1.0000"},{"v":0,"d":"0.0000"},"","",0,{"v":0,"d":"0.00"},"TOWER",null,"TOWER600.txt",{"$nulls":36},{"v":0,"d":"0.0"},{"v":0,"d":"0.0"},{"v":0,"d":"0.0"},{"v":0,"d":"0.0"},null,0,0,0,0]
[null,"","",{"v":0,"d":"0.00"},0,{"v":0,"d":"0.00"},{"$f":"IF(K67=\"\", _xlfn.IFS($C314=\"Angle\",(D314*I314)+G313,$C314=\"Loop\",$G$289,$C314=\"\",G313,$C314=\"End\",G313,$C314=\">\",G313+D314,$C314=\"<\",G313-D314,OR($C314=\"Λ\",$C314=\"V\"),G313), K67)","v":{"v":3.5,"d":"3.50"}},{"$f":"IF(L67=\"\",_xlfn.IFS($C314=\"Angle\",(D314*J314)+H313,$C314=\"Loop\",$H$289,$C314=\"\",H313,$C314=\"End\",H313,$C314=\"Λ\",H313+D314,$C314=\"V\",H313-D314,OR($C314=\"<\",$C314=\">\"),H313),L67)","v":{"v":-5,"d":"-5.00"}},{"v":1,"d":"1.0000"},{"v":0,"d":"0.0000"},"","",0,{"v":0,"d":"0.00"},"TOWER",null,"TOWER600.txt",{"$nulls":36},{"v":0,"d":"0.0"},{"v":0,"d":"0.0"},{"v":0,"d":"0.0"},{"v":0,"d":"0.0"},null,0,0,0,0]
[null,"","",{"v":0,"d":"0.00"},0,{"v":0,"d":"0.00"},{"$f":"IF(K68=\"\", _xlfn.IFS($C315=\"Angle\",(D315*I315)+G314,$C315=\"Loop\",$G$289,$C315=\"\",G314,$C315=\"End\",G314,$C315=\">\",G314+D315,$C315=\"<\",G314-D315,OR($C315=\"Λ\",$C315=\"V\"),G314), K68)","v":{"v":3.5,"d":"3.50"}},{"$f":"IF(L68=\"\",_xlfn.IFS($C315=\"Angle\",(D315*J315)+H314,$C315=\"Loop\",$H$289,$C315=\"\",H314,$C315=\"End\",H314,$C315=\"Λ\",H314+D315,$C315=\"V\",H314-D315,OR($C315=\"<\",$C315=\">\"),H314),L68)","v":{"v":-5,"d":"-5.00"}},{"v":1,"d":"1.0000"},{"v":0,"d":"0.0000"},"","",0,{"v":0,"d":"0.00"},"TOWER",null,"TOWER600.txt",{"$nulls":36},{"v":0,"d":"0.0"},{"v":0,"d":"0.0"},{"v":0,"d":"0.0"},{"v":0,"d":"0.0"},null,0,0,0,0]
[null,"","",{"v":0,"d":"0.00"},0,{"v":0,"d":"0.00"},{"$f":"IF(K69=\"\", _xlfn.IFS($C316=\"Angle\",(D316*I316)+G315,$C316=\"Loop\",$G$289,$C316=\"\",G315,$C316=\"End\",G315,$C316=\">\",G315+D316,$C316=\"<\",G315-D316,OR($C316=\"Λ\",$C316=\"V\"),G315), K69)","v":{"v":3.5,"d":"3.50"}},{"$f":"IF(L69=\"\",_xlfn.IFS($C316=\"Angle\",(D316*J316)+H315,$C316=\"Loop\",$H$289,$C316=\"\",H315,$C316=\"End\",H315,$C316=\"Λ\",H315+D316,$C316=\"V\",H315-D316,OR($C316=\"<\",$C316=\">\"),H315),L69)","v":{"v":-5,"d":"-5.00"}},{"v":1,"d":"1.0000"},{"v":0,"d":"0.0000"},"","",0,{"v":0,"d":"0.00"},"TOWER",null,"TOWER600.txt",{"$nulls":36},{"v":0,"d":"0.0"},{"v":0,"d":"0.0"},{"v":0,"d":"0.0"},{"v":0,"d":"0.0"},null,0,0,0,0]
[null,"","",{"v":0,"d":"0.00"},0,{"v":0,"d":"0.00"},{"$f":"IF(K70=\"\", _xlfn.IFS($C317=\"Angle\",(D317*I317)+G316,$C317=\"Loop\",$G$289,$C317=\"\",G316,$C317=\"End\",G316,$C317=\">\",G316+D317,$C317=\"<\",G316-D317,OR($C317=\"Λ\",$C317=\"V\"),G316), K70)","v":{"v":3.5,"d":"3.50"}},{"$f":"IF(L70=\"\",_xlfn.IFS($C317=\"Angle\",(D317*J317)+H316,$C317=\"Loop\",$H$289,$C317=\"\",H316,$C317=\"End\",H316,$C317=\"Λ\",H316+D317,$C317=\"V\",H316-D317,OR($C317=\"<\",$C317=\">\"),H316),L70)","v":{"v":-5,"d":"-5.00"}},{"v":1,"d":"1.0000"},{"v":0,"d":"0.0000"},"","",0,{"v":0,"d":"0.00"},"TOWER",null,"TOWER600.txt",{"$nulls":36},{"v":0,"d":"0.0"},{"v":0,"d":"0.0"},{"v":0,"d":"0.0"},{"v":0,"d":"0.0"},null,0,0,0,0]
[null,"","",{"v":0,"d":"0.00"},0,{"v":0,"d":"0.00"},{"$f":"IF(K71=\"\", _xlfn.IFS($C318=\"Angle\",(D318*I318)+G317,$C318=\"Loop\",$G$289,$C318=\"\",G317,$C318=\"End\",G317,$C318=\">\",G317+D318,$C318=\"<\",G317-D318,OR($C318=\"Λ\",$C318=\"V\"),G317), K71)","v":{"v":3.5,"d":"3.50"}},{"$f":"IF(L71=\"\",_xlfn.IFS($C318=\"Angle\",(D318*J318)+H317,$C318=\"Loop\",$H$289,$C318=\"\",H317,$C318=\"End\",H317,$C318=\"Λ\",H317+D318,$C318=\"V\",H317-D318,OR($C318=\"<\",$C318=\">\"),H317),L71)","v":{"v":-5,"d":"-5.00"}},{"v":1,"d":"1.0000"},{"v":0,"d":"0.0000"},"","",0,{"v":0,"d":"0.00"},"TOWER",null,"TOWER600.txt",{"$nulls":36},{"v":0,"d":"0.0"},{"v":0,"d":"0.0"},{"v":0,"d":"0.0"},{"v":0,"d":"0.0"},null,0,0,0,0]
[null,"","",{"v":0,"d":"0.00"},0,{"v":0,"d":"0.00"},{"$f":"IF(K72=\"\", _xlfn.IFS($C319=\"Angle\",(D319*I319)+G318,$C319=\"Loop\",$G$289,$C319=\"\",G318,$C319=\"End\",G318,$C319=\">\",G318+D319,$C319=\"<\",G318-D319,OR($C319=\"Λ\",$C319=\"V\"),G318), K72)","v":{"v":3.5,"d":"3.50"}},{"$f":"IF(L72=\"\",_xlfn.IFS($C319=\"Angle\",(D319*J319)+H318,$C319=\"Loop\",$H$289,$C319=\"\",H318,$C319=\"End\",H318,$C319=\"Λ\",H318+D319,$C319=\"V\",H318-D319,OR($C319=\"<\",$C319=\">\"),H318),L72)","v":{"v":-5,"d":"-5.00"}},{"v":1,"d":"1.0000"},{"v":0,"d":"0.0000"},"","",0,{"v":0,"d":"0.00"},"TOWER",null,"TOWER600.txt",{"$nulls":36},{"v":0,"d":"0.0"},{"v":0,"d":"0.0"},{"v":0,"d":"0.0"},{"v":0,"d":"0.0"},null,0,0,0,0]
[null,"","",{"v":0,"d":"0.00"},0,{"v":0,"d":"0.00"},{"$f":"IF(K73=\"\", _xlfn.IFS($C320=\"Angle\",(D320*I320)+G319,$C320=\"Loop\",$G$289,$C320=\"\",G319,$C320=\"End\",G319,$C320=\">\",G319+D320,$C320=\"<\",G319-D320,OR($C320=\"Λ\",$C320=\"V\"),G319), K73)","v":{"v":3.5,"d":"3.50"}},{"$f":"IF(L73=\"\",_xlfn.IFS($C320=\"Angle\",(D320*J320)+H319,$C320=\"Loop\",$H$289,$C320=\"\",H319,$C320=\"End\",H319,$C320=\"Λ\",H319+D320,$C320=\"V\",H319-D320,OR($C320=\"<\",$C320=\">\"),H319),L73)","v":{"v":-5,"d":"-5.00"}},{"v":1,"d":"1.0000"},{"v":0,"d":"0.0000"},"","",0,{"v":0,"d":"0.00"},"TOWER",null,"TOWER600.txt",{"$nulls":36},{"v":0,"d":"0.0"},{"v":0,"d":"0.0"},{"v":0,"d":"0.0"},{"v":0,"d":"0.0"},null,0,0,0,0]
[null,"","",{"v":0,"d":"0.00"},0,{"v":0,"d":"0.00"},{"$f":"IF(K74=\"\", _xlfn.IFS($C321=\"Angle\",(D321*I321)+G320,$C321=\"Loop\",$G$289,$C321=\"\",G320,$C321=\"End\",G320,$C321=\">\",G320+D321,$C321=\"<\",G320-D321,OR($C321=\"Λ\",$C321=\"V\"),G320), K74)","v":{"v":3.5,"d":"3.50"}},{"$f":"IF(L74=\"\",_xlfn.IFS($C321=\"Angle\",(D321*J321)+H320,$C321=\"Loop\",$H$289,$C321=\"\",H320,$C321=\"End\",H320,$C321=\"Λ\",H320+D321,$C321=\"V\",H320-D321,OR($C321=\"<\",$C321=\">\"),H320),L74)","v":{"v":-5,"d":"-5.00"}},{"v":1,"d":"1.0000"},{"v":0,"d":"0.0000"},"","",0,{"v":0,"d":"0.00"},"TOWER",null,"TOWER600.txt",{"$nulls":36},{"v":0,"d":"0.0"},{"v":0,"d":"0.0"},{"v":0,"d":"0.0"},{"v":0,"d":"0.0"},null,0,0,0,0]
[null,"","",{"v":0,"d":"0.00"},0,{"v":0,"d":"0.00"},{"$f":"IF(K75=\"\", _xlfn.IFS($C322=\"Angle\",(D322*I322)+G321,$C322=\"Loop\",$G$289,$C322=\"\",G321,$C322=\"End\",G321,$C322=\">\",G321+D322,$C322=\"<\",G321-D322,OR($C322=\"Λ\",$C322=\"V\"),G321), K75)","v":{"v":3.5,"d":"3.50"}},{"$f":"IF(L75=\"\",_xlfn.IFS($C322=\"Angle\",(D322*J322)+H321,$C322=\"Loop\",$H$289,$C322=\"\",H321,$C322=\"End\",H321,$C322=\"Λ\",H321+D322,$C322=\"V\",H321-D322,OR($C322=\"<\",$C322=\">\"),H321),L75)","v":{"v":-5,"d":"-5.00"}},{"v":1,"d":"1.0000"},{"v":0,"d":"0.0000"},"","",0,{"v":0,"d":"0.00"},"TOWER",null,"TOWER600.txt",{"$nulls":36},{"v":0,"d":"0.0"},{"v":0,"d":"0.0"},{"v":0,"d":"0.0"},{"v":0,"d":"0.0"},null,0,0,0,0]
[null,"","",{"v":0,"d":"0.00"},0,{"v":0,"d":"0.00"},{"$f":"IF(K76=\"\", _xlfn.IFS($C323=\"Angle\",(D323*I323)+G322,$C323=\"Loop\",$G$289,$C323=\"\",G322,$C323=\"End\",G322,$C323=\">\",G322+D323,$C323=\"<\",G322-D323,OR($C323=\"Λ\",$C323=\"V\"),G322), K76)","v":{"v":3.5,"d":"3.50"}},{"$f":"IF(L76=\"\",_xlfn.IFS($C323=\"Angle\",(D323*J323)+H322,$C323=\"Loop\",$H$289,$C323=\"\",H322,$C323=\"End\",H322,$C323=\"Λ\",H322+D323,$C323=\"V\",H322-D323,OR($C323=\"<\",$C323=\">\"),H322),L76)","v":{"v":-5,"d":"-5.00"}},{"v":1,"d":"1.0000"},{"v":0,"d":"0.0000"},"","",0,{"v":0,"d":"0.00"},"TOWER",null,"TOWER600.txt",{"$nulls":36},{"v":0,"d":"0.0"},{"v":0,"d":"0.0"},{"v":0,"d":"0.0"},{"v":0,"d":"0.0"},null,0,0,0,0]
[null,"","",{"v":0,"d":"0.00"},0,{"v":0,"d":"0.00"},{"$f":"IF(K77=\"\", _xlfn.IFS($C324=\"Angle\",(D324*I324)+G323,$C324=\"Loop\",$G$289,$C324=\"\",G323,$C324=\"End\",G323,$C324=\">\",G323+D324,$C324=\"<\",G323-D324,OR($C324=\"Λ\",$C324=\"V\"),G323), K77)","v":{"v":3.5,"d":"3.50"}},{"$f":"IF(L77=\"\",_xlfn.IFS($C324=\"Angle\",(D324*J324)+H323,$C324=\"Loop\",$H$289,$C324=\"\",H323,$C324=\"End\",H323,$C324=\"Λ\",H323+D324,$C324=\"V\",H323-D324,OR($C324=\"<\",$C324=\">\"),H323),L77)","v":{"v":-5,"d":"-5.00"}},{"v":1,"d":"1.0000"},{"v":0,"d":"0.0000"},"","",0,{"v":0,"d":"0.00"},"TOWER",null,"TOWER600.txt",{"$nulls":36},{"v":0,"d":"0.0"},{"v":0,"d":"0.0"},{"v":0,"d":"0.0"},{"v":0,"d":"0.0"},null,0,0,0,0]
[null,"","",{"v":0,"d":"0.00"},0,{"v":0,"d":"0.00"},{"$f":"IF(K78=\"\", _xlfn.IFS($C325=\"Angle\",(D325*I325)+G324,$C325=\"Loop\",$G$289,$C325=\"\",G324,$C325=\"End\",G324,$C325=\">\",G324+D325,$C325=\"<\",G324-D325,OR($C325=\"Λ\",$C325=\"V\"),G324), K78)","v":{"v":3.5,"d":"3.50"}},{"$f":"IF(L78=\"\",_xlfn.IFS($C325=\"Angle\",(D325*J325)+H324,$C325=\"Loop\",$H$289,$C325=\"\",H324,$C325=\"End\",H324,$C325=\"Λ\",H324+D325,$C325=\"V\",H324-D325,OR($C325=\"<\",$C325=\">\"),H324),L78)","v":{"v":-5,"d":"-5.00"}},{"v":1,"d":"1.0000"},{"v":0,"d":"0.0000"},"","",0,{"v":0,"d":"0.00"},"TOWER",null,"TOWER600.txt",{"$nulls":36},{"v":0,"d":"0.0"},{"v":0,"d":"0.0"},{"v":0,"d":"0.0"},{"v":0,"d":"0.0"},null,0,0,0,0]
[null,"","",{"v":0,"d":"0.00"},0,{"v":0,"d":"0.00"},{"$f":"IF(K79=\"\", _xlfn.IFS($C326=\"Angle\",(D326*I326)+G325,$C326=\"Loop\",$G$289,$C326=\"\",G325,$C326=\"End\",G325,$C326=\">\",G325+D326,$C326=\"<\",G325-D326,OR($C326=\"Λ\",$C326=\"V\"),G325), K79)","v":{"v":3.5,"d":"3.50"}},{"$f":"IF(L79=\"\",_xlfn.IFS($C326=\"Angle\",(D326*J326)+H325,$C326=\"Loop\",$H$289,$C326=\"\",H325,$C326=\"End\",H325,$C326=\"Λ\",H325+D326,$C326=\"V\",H325-D326,OR($C326=\"<\",$C326=\">\"),H325),L79)","v":{"v":-5,"d":"-5.00"}},{"v":1,"d":"1.0000"},{"v":0,"d":"0.0000"},"","",0,{"v":0,"d":"0.00"},"TOWER",null,"TOWER600.txt",{"$nulls":36},{"v":0,"d":"0.0"},{"v":0,"d":"0.0"},{"v":0,"d":"0.0"},{"v":0,"d":"0.0"},null,0,0,0,0]
[null,"","",{"v":0,"d":"0.00"},0,{"v":0,"d":"0.00"},{"$f":"IF(K80=\"\", _xlfn.IFS($C327=\"Angle\",(D327*I327)+G326,$C327=\"Loop\",$G$289,$C327=\"\",G326,$C327=\"End\",G326,$C327=\">\",G326+D327,$C327=\"<\",G326-D327,OR($C327=\"Λ\",$C327=\"V\"),G326), K80)","v":{"v":3.5,"d":"3.50"}},{"$f":"IF(L80=\"\",_xlfn.IFS($C327=\"Angle\",(D327*J327)+H326,$C327=\"Loop\",$H$289,$C327=\"\",H326,$C327=\"End\",H326,$C327=\"Λ\",H326+D327,$C327=\"V\",H326-D327,OR($C327=\"<\",$C327=\">\"),H326),L80)","v":{"v":-5,"d":"-5.00"}},{"v":1,"d":"1.0000"},{"v":0,"d":"0.0000"},"","",0,{"v":0,"d":"0.00"},"TOWER",null,"TOWER600.txt",{"$nulls":36},{"v":0,"d":"0.0"},{"v":0,"d":"0.0"},{"v":0,"d":"0.0"},{"v":0,"d":"0.0"},null,0,0,0,0]
[null,"","",{"v":0,"d":"0.00"},0,{"v":0,"d":"0.00"},{"$f":"IF(K81=\"\", _xlfn.IFS($C328=\"Angle\",(D328*I328)+G327,$C328=\"Loop\",$G$289,$C328=\"\",G327,$C328=\"End\",G327,$C328=\">\",G327+D328,$C328=\"<\",G327-D328,OR($C328=\"Λ\",$C328=\"V\"),G327), K81)","v":{"v":3.5,"d":"3.50"}},{"$f":"IF(L81=\"\",_xlfn.IFS($C328=\"Angle\",(D328*J328)+H327,$C328=\"Loop\",$H$289,$C328=\"\",H327,$C328=\"End\",H327,$C328=\"Λ\",H327+D328,$C328=\"V\",H327-D328,OR($C328=\"<\",$C328=\">\"),H327),L81)","v":{"v":-5,"d":"-5.00"}},{"v":1,"d":"1.0000"},{"v":0,"d":"0.0000"},"","",0,{"v":0,"d":"0.00"},"TOWER",null,"TOWER600.txt",{"$nulls":36},{"v":0,"d":"0.0"},{"v":0,"d":"0.0"},{"v":0,"d":"0.0"},{"v":0,"d":"0.0"},null,0,0,0,0]
[null,"","",{"v":0,"d":"0.00"},0,{"v":0,"d":"0.00"},{"$f":"IF(K82=\"\", _xlfn.IFS($C329=\"Angle\",(D329*I329)+G328,$C329=\"Loop\",$G$289,$C329=\"\",G328,$C329=\"End\",G328,$C329=\">\",G328+D329,$C329=\"<\",G328-D329,OR($C329=\"Λ\",$C329=\"V\"),G328), K82)","v":{"v":3.5,"d":"3.50"}},{"$f":"IF(L82=\"\",_xlfn.IFS($C329=\"Angle\",(D329*J329)+H328,$C329=\"Loop\",$H$289,$C329=\"\",H328,$C329=\"End\",H328,$C329=\"Λ\",H328+D329,$C329=\"V\",H328-D329,OR($C329=\"<\",$C329=\">\"),H328),L82)","v":{"v":-5,"d":"-5.00"}},{"v":1,"d":"1.0000"},{"v":0,"d":"0.0000"},"","",0,{"v":0,"d":"0.00"},"TOWER",null,"TOWER600.txt",{"$nulls":36},{"v":0,"d":"0.0"},{"v":0,"d":"0.0"},{"v":0,"d":"0.0"},{"v":0,"d":"0.0"},null,0,0,0,0]
[null,"","",{"v":0,"d":"0.00"},0,{"v":0,"d":"0.00"},{"$f":"IF(K83=\"\", _xlfn.IFS($C330=\"Angle\",(D330*I330)+G329,$C330=\"Loop\",$G$289,$C330=\"\",G329,$C330=\"End\",G329,$C330=\">\",G329+D330,$C330=\"<\",G329-D330,OR($C330=\"Λ\",$C330=\"V\"),G329), K83)","v":{"v":3.5,"d":"3.50"}},{"$f":"IF(L83=\"\",_xlfn.IFS($C330=\"Angle\",(D330*J330)+H329,$C330=\"Loop\",$H$289,$C330=\"\",H329,$C330=\"End\",H329,$C330=\"Λ\",H329+D330,$C330=\"V\",H329-D330,OR($C330=\"<\",$C330=\">\"),H329),L83)","v":{"v":-5,"d":"-5.00"}},{"v":1,"d":"1.0000"},{"v":0,"d":"0.0000"},"","",0,{"v":0,"d":"0.00"},"TOWER",null,"TOWER600.txt",{"$nulls":36},{"v":0,"d":"0.0"},{"v":0,"d":"0.0"},{"v":0,"d":"0.0"},{"v":0,"d":"0.0"},null,0,0,0,0]
[null,"","",{"v":0,"d":"0.00"},0,{"v":0,"d":"0.00"},{"$f":"IF(K84=\"\", _xlfn.IFS($C331=\"Angle\",(D331*I331)+G330,$C331=\"Loop\",$G$289,$C331=\"\",G330,$C331=\"End\",G330,$C331=\">\",G330+D331,$C331=\"<\",G330-D331,OR($C331=\"Λ\",$C331=\"V\"),G330), K84)","v":{"v":3.5,"d":"3.50"}},{"$f":"IF(L84=\"\",_xlfn.IFS($C331=\"Angle\",(D331*J331)+H330,$C331=\"Loop\",$H$289,$C331=\"\",H330,$C331=\"End\",H330,$C331=\"Λ\",H330+D331,$C331=\"V\",H330-D331,OR($C331=\"<\",$C331=\">\"),H330),L84)","v":{"v":-5,"d":"-5.00"}},{"v":1,"d":"1.0000"},{"v":0,"d":"0.0000"},"","",0,{"v":0,"d":"0.00"},"TOWER",null,"TOWER600.txt",{"$nulls":36},{"v":0,"d":"0.0"},{"v":0,"d":"0.0"},{"v":0,"d":"0.0"},{"v":0,"d":"0.0"},null,0,0,0,0]
[null,"","",{"v":0,"d":"0.00"},0,{"v":0,"d":"0.00"},{"$f":"IF(K85=\"\", _xlfn.IFS($C332=\"Angle\",(D332*I332)+G331,$C332=\"Loop\",$G$289,$C332=\"\",G331,$C332=\"End\",G331,$C332=\">\",G331+D332,$C332=\"<\",G331-D332,OR($C332=\"Λ\",$C332=\"V\"),G331), K85)","v":{"v":3.5,"d":"3.50"}},{"$f":"IF(L85=\"\",_xlfn.IFS($C332=\"Angle\",(D332*J332)+H331,$C332=\"Loop\",$H$289,$C332=\"\",H331,$C332=\"End\",H331,$C332=\"Λ\",H331+D332,$C332=\"V\",H331-D332,OR($C332=\"<\",$C332=\">\"),H331),L85)","v":{"v":-5,"d":"-5.00"}},{"v":1,"d":"1.0000"},{"v":0,"d":"0.0000"},"","",0,{"v":0,"d":"0.00"},"TOWER",null,"TOWER600.txt",{"$nulls":36},{"v":0,"d":"0.0"},{"v":0,"d":"0.0"},{"v":0,"d":"0.0"},{"v":0,"d":"0.0"},null,0,0,0,0]
[null,"","",{"v":0,"d":"0.00"},0,{"v":0,"d":"0.00"},{"$f":"IF(K86=\"\", _xlfn.IFS($C333=\"Angle\",(D333*I333)+G332,$C333=\"Loop\",$G$289,$C333=\"\",G332,$C333=\"End\",G332,$C333=\">\",G332+D333,$C333=\"<\",G332-D333,OR($C333=\"Λ\",$C333=\"V\"),G332), K86)","v":{"v":3.5,"d":"3.50"}},{"$f":"IF(L86=\"\",_xlfn.IFS($C333=\"Angle\",(D333*J333)+H332,$C333=\"Loop\",$H$289,$C333=\"\",H332,$C333=\"End\",H332,$C333=\"Λ\",H332+D333,$C333=\"V\",H332-D333,OR($C333=\"<\",$C333=\">\"),H332),L86)","v":{"v":-5,"d":"-5.00"}},{"v":1,"d":"1.0000"},{"v":0,"d":"0.0000"},"","",0,{"v":0,"d":"0.00"},"TOWER",null,"TOWER600.txt",{"$nulls":36},{"v":0,"d":"0.0"},{"v":0,"d":"0.0"},{"v":0,"d":"0.0"},{"v":0,"d":"0.0"},null,0,0,0,0]
[null,"","",{"v":0,"d":"0.00"},0,{"v":0,"d":"0.00"},{"$f":"IF(K87=\"\", _xlfn.IFS($C334=\"Angle\",(D334*I334)+G333,$C334=\"Loop\",$G$289,$C334=\"\",G333,$C334=\"End\",G333,$C334=\">\",G333+D334,$C334=\"<\",G333-D334,OR($C334=\"Λ\",$C334=\"V\"),G333), K87)","v":{"v":3.5,"d":"3.50"}},{"$f":"IF(L87=\"\",_xlfn.IFS($C334=\"Angle\",(D334*J334)+H333,$C334=\"Loop\",$H$289,$C334=\"\",H333,$C334=\"End\",H333,$C334=\"Λ\",H333+D334,$C334=\"V\",H333-D334,OR($C334=\"<\",$C334=\">\"),H333),L87)","v":{"v":-5,"d":"-5.00"}},{"v":1,"d":"1.0000"},{"v":0,"d":"0.0000"},"","",0,{"v":0,"d":"0.00"},"TOWER",null,"TOWER600.txt",{"$nulls":36},{"v":0,"d":"0.0"},{"v":0,"d":"0.0"},{"v":0,"d":"0.0"},{"v":0,"d":"0.0"},null,0,0,0,0]
[null,"","",{"v":0,"d":"0.00"},0,{"v":0,"d":"0.00"},{"$f":"IF(K88=\"\", _xlfn.IFS($C335=\"Angle\",(D335*I335)+G334,$C335=\"Loop\",$G$289,$C335=\"\",G334,$C335=\"End\",G334,$C335=\">\",G334+D335,$C335=\"<\",G334-D335,OR($C335=\"Λ\",$C335=\"V\"),G334), K88)","v":{"v":3.5,"d":"3.50"}},{"$f":"IF(L88=\"\",_xlfn.IFS($C335=\"Angle\",(D335*J335)+H334,$C335=\"Loop\",$H$289,$C335=\"\",H334,$C335=\"End\",H334,$C335=\"Λ\",H334+D335,$C335=\"V\",H334-D335,OR($C335=\"<\",$C335=\">\"),H334),L88)","v":{"v":-5,"d":"-5.00"}},{"v":1,"d":"1.0000"},{"v":0,"d":"0.0000"},"","",0,{"v":0,"d":"0.00"},"TOWER",null,"TOWER600.txt",{"$nulls":36},{"v":0,"d":"0.0"},{"v":0,"d":"0.0"},{"v":0,"d":"0.0"},{"v":0,"d":"0.0"},null,0,0,0,0]
[null,"","",{"v":0,"d":"0.00"},0,{"v":0,"d":"0.00"},{"$f":"IF(K89=\"\", _xlfn.IFS($C336=\"Angle\",(D336*I336)+G335,$C336=\"Loop\",$G$289,$C336=\"\",G335,$C336=\"End\",G335,$C336=\">\",G335+D336,$C336=\"<\",G335-D336,OR($C336=\"Λ\",$C336=\"V\"),G335), K89)","v":{"v":3.5,"d":"3.50"}},{"$f":"IF(L89=\"\",_xlfn.IFS($C336=\"Angle\",(D336*J336)+H335,$C336=\"Loop\",$H$289,$C336=\"\",H335,$C336=\"End\",H335,$C336=\"Λ\",H335+D336,$C336=\"V\",H335-D336,OR($C336=\"<\",$C336=\">\"),H335),L89)","v":{"v":-5,"d":"-5.00"}},{"v":1,"d":"1.0000"},{"v":0,"d":"0.0000"},"","",0,{"v":0,"d":"0.00"},"TOWER",null,"TOWER600.txt",{"$nulls":36},{"v":0,"d":"0.0"},{"v":0,"d":"0.0"},{"v":0,"d":"0.0"},{"v":0,"d":"0.0"},null,0,0,0,0]
[null,"","",{"v":0,"d":"0.00"},0,{"v":0,"d":"0.00"},{"$f":"IF(K90=\"\", _xlfn.IFS($C337=\"Angle\",(D337*I337)+G336,$C337=\"Loop\",$G$289,$C337=\"\",G336,$C337=\"End\",G336,$C337=\">\",G336+D337,$C337=\"<\",G336-D337,OR($C337=\"Λ\",$C337=\"V\"),G336), K90)","v":{"v":3.5,"d":"3.50"}},{"$f":"IF(L90=\"\",_xlfn.IFS($C337=\"Angle\",(D337*J337)+H336,$C337=\"Loop\",$H$289,$C337=\"\",H336,$C337=\"End\",H336,$C337=\"Λ\",H336+D337,$C337=\"V\",H336-D337,OR($C337=\"<\",$C337=\">\"),H336),L90)","v":{"v":-5,"d":"-5.00"}},{"v":1,"d":"1.0000"},{"v":0,"d":"0.0000"},"","",0,{"v":0,"d":"0.00"},"TOWER",null,"TOWER600.txt",{"$nulls":36},{"v":0,"d":"0.0"},{"v":0,"d":"0.0"},{"v":0,"d":"0.0"},{"v":0,"d":"0.0"},null,0,0,0,0]
[null,"","",{"v":0,"d":"0.00"},0,{"v":0,"d":"0.00"},{"$f":"IF(K91=\"\", _xlfn.IFS($C338=\"Angle\",(D338*I338)+G337,$C338=\"Loop\",$G$289,$C338=\"\",G337,$C338=\"End\",G337,$C338=\">\",G337+D338,$C338=\"<\",G337-D338,OR($C338=\"Λ\",$C338=\"V\"),G337), K91)","v":{"v":3.5,"d":"3.50"}},{"$f":"IF(L91=\"\",_xlfn.IFS($C338=\"Angle\",(D338*J338)+H337,$C338=\"Loop\",$H$289,$C338=\"\",H337,$C338=\"End\",H337,$C338=\"Λ\",H337+D338,$C338=\"V\",H337-D338,OR($C338=\"<\",$C338=\">\"),H337),L91)","v":{"v":-5,"d":"-5.00"}},{"v":1,"d":"1.0000"},{"v":0,"d":"0.0000"},"","",0,{"v":0,"d":"0.00"},"TOWER",null,"TOWER600.txt",{"$nulls":36},{"v":0,"d":"0.0"},{"v":0,"d":"0.0"},{"v":0,"d":"0.0"},{"v":0,"d":"0.0"},null,0,0,0,0]
[null,"","",{"v":0,"d":"0.00"},0,{"v":0,"d":"0.00"},{"$f":"IF(K92=\"\", _xlfn.IFS($C339=\"Angle\",(D339*I339)+G338,$C339=\"Loop\",$G$289,$C339=\"\",G338,$C339=\"End\",G338,$C339=\">\",G338+D339,$C339=\"<\",G338-D339,OR($C339=\"Λ\",$C339=\"V\"),G338), K92)","v":{"v":3.5,"d":"3.50"}},{"$f":"IF(L92=\"\",_xlfn.IFS($C339=\"Angle\",(D339*J339)+H338,$C339=\"Loop\",$H$289,$C339=\"\",H338,$C339=\"End\",H338,$C339=\"Λ\",H338+D339,$C339=\"V\",H338-D339,OR($C339=\"<\",$C339=\">\"),H338),L92)","v":{"v":-5,"d":"-5.00"}},{"v":1,"d":"1.0000"},{"v":0,"d":"0.0000"},"","",0,{"v":0,"d":"0.00"},"TOWER",null,"TOWER600.txt",{"$nulls":36},{"v":0,"d":"0.0"},{"v":0,"d":"0.0"},{"v":0,"d":"0.0"},{"v":0,"d":"0.0"},null,0,0,0,0]
[null,"","",{"v":0,"d":"0.00"},0,{"$f":"+IF(C340=\"Loop\",SQRT((G340-G339)^2+(H340-H339)^2),0)","v":{"v":0,"d":"0.00"}},{"$f":"IF(K93=\"\", _xlfn.IFS($C340=\"Angle\",(D340*I340)+G339,$C340=\"Loop\",$G$289,$C340=\"\",G339,$C340=\"End\",G339,$C340=\">\",G339+D340,$C340=\"<\",G339-D340,OR($C340=\"Λ\",$C340=\"V\"),G339), K93)","v":{"v":3.5,"d":"3.50"}},{"$f":"IF(L93=\"\",_xlfn.IFS($C340=\"Angle\",(D340*J340)+H339,$C340=\"Loop\",$H$289,$C340=\"\",H339,$C340=\"End\",H339,$C340=\"Λ\",H339+D340,$C340=\"V\",H339-D340,OR($C340=\"<\",$C340=\">\"),H339),L93)","v":{"v":-5,"d":"-5.00"}},{"$f":"+COS(RADIANS(E340))","v":{"v":1,"d":"1.0000"}},{"$f":"SIN(RADIANS(E340))","v":{"v":0,"d":"0.0000"}},{"$f":"+IF(OR(D340=0,D340=\"\"),\"\",IF(MOD(D340,$K$286),_xlfn.FLOOR.MATH(D340/$K$286),_xlfn.FLOOR.MATH(D340/$K$286)-1))","v":""},{"$f":"+IF(OR(F340=0,F340=\"\"),\"\",IF(MOD(F340,$K$286),_xlfn.FLOOR.MATH(F340/$K$286),_xlfn.FLOOR.MATH(F340/$K$286)-1))","v":""},{"$f":"+MAX(K340:L340)","v":0},{"$f":"IF(AND(D340=0,F340=0),0,IF(D340<>0,D340/(M340+1),F340/(M340+1)))","v":{"v":0,"d":"0.00"}},"TOWER",null,"TOWER600.txt",{"$nulls":36},{"v":0,"d":"0.0"},{"v":0,"d":"0.0"},{"v":0,"d":"0.0"},{"v":0,"d":"0.0"},null,0,0,0,0]
[null,"","",{"v":0,"d":"0.00"},0,{"$f":"+IF(C341=\"Loop\",SQRT((G341-G340)^2+(H341-H340)^2),0)","v":{"v":0,"d":"0.00"}},{"$f":"IF(K94=\"\", _xlfn.IFS($C341=\"Angle\",(D341*I341)+G340,$C341=\"Loop\",$G$289,$C341=\"\",G340,$C341=\"End\",G340,$C341=\">\",G340+D341,$C341=\"<\",G340-D341,OR($C341=\"Λ\",$C341=\"V\"),G340), K94)","v":{"v":3.5,"d":"3.50"}},{"$f":"IF(L94=\"\",_xlfn.IFS($C341=\"Angle\",(D341*J341)+H340,$C341=\"Loop\",$H$289,$C341=\"\",H340,$C341=\"End\",H340,$C341=\"Λ\",H340+D341,$C341=\"V\",H340-D341,OR($C341=\"<\",$C341=\">\"),H340),L94)","v":{"v":-5,"d":"-5.00"}},{"$f":"+COS(RADIANS(E341))","v":{"v":1,"d":"1.0000"}},{"$f":"SIN(RADIANS(E341))","v":{"v":0,"d":"0.0000"}},{"$f":"+IF(OR(D341=0,D341=\"\"),\"\",IF(MOD(D341,$K$286),_xlfn.FLOOR.MATH(D341/$K$286),_xlfn.FLOOR.MATH(D341/$K$286)-1))","v":""},{"$f":"+IF(OR(F341=0,F341=\"\"),\"\",IF(MOD(F341,$K$286),_xlfn.FLOOR.MATH(F341/$K$286),_xlfn.FLOOR.MATH(F341/$K$286)-1))","v":""},{"$f":"+MAX(K341:L341)","v":0},{"$f":"IF(AND(D341=0,F341=0),0,IF(D341<>0,D341/(M341+1),F341/(M341+1)))","v":{"v":0,"d":"0.00"}},"TOWER",null,"TOWER600.txt",{"$nulls":36},{"v":0,"d":"0.0"},{"v":0,"d":"0.0"},{"v":0,"d":"0.0"},{"v":0,"d":"0.0"},null,0,0,0,0]
[null,"","",{"v":0,"d":"0.00"},0,{"$f":"+IF(C342=\"Loop\",SQRT((G342-G341)^2+(H342-H341)^2),0)","v":{"v":0,"d":"0.00"}},{"$f":"IF(K95=\"\", _xlfn.IFS($C342=\"Angle\",(D342*I342)+G341,$C342=\"Loop\",$G$289,$C342=\"\",G341,$C342=\"End\",G341,$C342=\">\",G341+D342,$C342=\"<\",G341-D342,OR($C342=\"Λ\",$C342=\"V\"),G341), K95)","v":{"v":3.5,"d":"3.50"}},{"$f":"IF(L95=\"\",_xlfn.IFS($C342=\"Angle\",(D342*J342)+H341,$C342=\"Loop\",$H$289,$C342=\"\",H341,$C342=\"End\",H341,$C342=\"Λ\",H341+D342,$C342=\"V\",H341-D342,OR($C342=\"<\",$C342=\">\"),H341),L95)","v":{"v":-5,"d":"-5.00"}},{"$f":"+COS(RADIANS(E342))","v":{"v":1,"d":"1.0000"}},{"$f":"SIN(RADIANS(E342))","v":{"v":0,"d":"0.0000"}},{"$f":"+IF(OR(D342=0,D342=\"\"),\"\",IF(MOD(D342,$K$286),_xlfn.FLOOR.MATH(D342/$K$286),_xlfn.FLOOR.MATH(D342/$K$286)-1))","v":""},{"$f":"+IF(OR(F342=0,F342=\"\"),\"\",IF(MOD(F342,$K$286),_xlfn.FLOOR.MATH(F342/$K$286),_xlfn.FLOOR.MATH(F342/$K$286)-1))","v":""},{"$f":"+MAX(K342:L342)","v":0},{"$f":"IF(AND(D342=0,F342=0),0,IF(D342<>0,D342/(M342+1),F342/(M342+1)))","v":{"v":0,"d":"0.00"}},"TOWER",null,"TOWER600.txt",{"$nulls":36},{"v":0,"d":"0.0"},{"v":0,"d":"0.0"},{"v":0,"d":"0.0"},{"v":0,"d":"0.0"},null,0,0,0,0]
[null,"","",{"v":0,"d":"0.00"},0,{"$f":"+IF(C343=\"Loop\",SQRT((G343-G342)^2+(H343-H342)^2),0)","v":{"v":0,"d":"0.00"}},{"$f":"IF(K96=\"\", _xlfn.IFS($C343=\"Angle\",(D343*I343)+G342,$C343=\"Loop\",$G$289,$C343=\"\",G342,$C343=\"End\",G342,$C343=\">\",G342+D343,$C343=\"<\",G342-D343,OR($C343=\"Λ\",$C343=\"V\"),G342), K96)","v":{"v":3.5,"d":"3.50"}},{"$f":"IF(L96=\"\",_xlfn.IFS($C343=\"Angle\",(D343*J343)+H342,$C343=\"Loop\",$H$289,$C343=\"\",H342,$C343=\"End\",H342,$C343=\"Λ\",H342+D343,$C343=\"V\",H342-D343,OR($C343=\"<\",$C343=\">\"),H342),L96)","v":{"v":-5,"d":"-5.00"}},{"$f":"+COS(RADIANS(E343))","v":{"v":1,"d":"1.0000"}},{"$f":"SIN(RADIANS(E343))","v":{"v":0,"d":"0.0000"}},{"$f":"+IF(OR(D343=0,D343=\"\"),\"\",IF(MOD(D343,$K$286),_xlfn.FLOOR.MATH(D343/$K$286),_xlfn.FLOOR.MATH(D343/$K$286)-1))","v":""},{"$f":"+IF(OR(F343=0,F343=\"\"),\"\",IF(MOD(F343,$K$286),_xlfn.FLOOR.MATH(F343/$K$286),_xlfn.FLOOR.MATH(F343/$K$286)-1))","v":""},{"$f":"+MAX(K343:L343)","v":0},{"$f":"IF(AND(D343=0,F343=0),0,IF(D343<>0,D343/(M343+1),F343/(M343+1)))","v":{"v":0,"d":"0.00"}},"TOWER",null,"TOWER600.txt",{"$nulls":36},{"v":0,"d":"0.0"},{"v":0,"d":"0.0"},{"v":0,"d":"0.0"},{"v":0,"d":"0.0"},null,0,0,0,0]
[null,"","",{"v":0,"d":"0.00"},0,{"$f":"+IF(C344=\"Loop\",SQRT((G344-G343)^2+(H344-H343)^2),0)","v":{"v":0,"d":"0.00"}},{"$f":"IF(K97=\"\", _xlfn.IFS($C344=\"Angle\",(D344*I344)+G343,$C344=\"Loop\",$G$289,$C344=\"\",G343,$C344=\"End\",G343,$C344=\">\",G343+D344,$C344=\"<\",G343-D344,OR($C344=\"Λ\",$C344=\"V\"),G343), K97)","v":{"v":3.5,"d":"3.50"}},{"$f":"IF(L97=\"\",_xlfn.IFS($C344=\"Angle\",(D344*J344)+H343,$C344=\"Loop\",$H$289,$C344=\"\",H343,$C344=\"End\",H343,$C344=\"Λ\",H343+D344,$C344=\"V\",H343-D344,OR($C344=\"<\",$C344=\">\"),H343),L97)","v":{"v":-5,"d":"-5.00"}},{"$f":"+COS(RADIANS(E344))","v":{"v":1,"d":"1.0000"}},{"$f":"SIN(RADIANS(E344))","v":{"v":0,"d":"0.0000"}},{"$f":"+IF(OR(D344=0,D344=\"\"),\"\",IF(MOD(D344,$K$286),_xlfn.FLOOR.MATH(D344/$K$286),_xlfn.FLOOR.MATH(D344/$K$286)-1))","v":""},{"$f":"+IF(OR(F344=0,F344=\"\"),\"\",IF(MOD(F344,$K$286),_xlfn.FLOOR.MATH(F344/$K$286),_xlfn.FLOOR.MATH(F344/$K$286)-1))","v":""},{"$f":"+MAX(K344:L344)","v":0},{"$f":"IF(AND(D344=0,F344=0),0,IF(D344<>0,D344/(M344+1),F344/(M344+1)))","v":{"v":0,"d":"0.00"}},{"$f":"IF(B344=\"\", O343, O97)","v":"TOWER"},null,"TOWER600.txt",{"$nulls":36},{"v":0,"d":"0.0"},{"v":0,"d":"0.0"},{"v":0,"d":"0.0"},{"v":0,"d":"0.0"},null,0,0,0,0]
[null,"",{"$nulls":4},{"$f":"G344","v":{"v":3.5,"d":"3.50"}},{"$f":"H344","v":{"v":-5,"d":"-5.00"}},{"$nulls":6},{"$f":"O344","v":"TOWER"},null,"TOWER600.txt",null,20]
[{"$nulls":18},10]
[]
[{"$nulls":5},"MIN",{"$f":"MIN(G289:G345)","v":{"v":0,"d":"0.00"}},{"$f":"MIN(H289:H345)","v":{"v":-5,"d":"-5.00"}},null,{"$f":"MIN(G348,H348)-1","v":{"v":-6,"d":"-6.00"}},{"$nulls":46},{"$f":"MAX(BE290:BE344)","v":{"$error":"#DIV/0!"}},null,{"$f":"MAX(BG290:BG344)","v":1},{"$f":"MAX(BH290:BH344)","v":{"$error":"#DIV/0!"}}]
[{"$nulls":5},"MAX",{"$f":"MAX(G289:G345)","v":{"v":16,"d":"16.00"}},{"$f":"MAX(H289:H345)","v":{"v":5,"d":"5.00"}},null,{"$f":"MAX(G349,H349)+1","v":{"v":17,"d":"17.00"}}]
[{"$nulls":18},"Unici 1","Unici2"]
[{"$nulls":18},{"$f":"+_xlfn.UNIQUE(C43:C97)","v":2},{"$f":"+_xlfn.UNIQUE(#REF!)","v":{"$error":"#REF!"}}]
[{"$nulls":18},3]
[{"$nulls":18},4]
[{"$nulls":18},5]
[{"$nulls":18},6]
[{"$nulls":18},7]
[{"$nulls":18},0]
[{"$nulls":18},0]

{"sheet":"SupTabella","index":2,"n_rows":75,"n_cols":15,"rows_kept":75,"hidden":true,"merged":[[46,2,46,3],[54,2,54,3]]}
[]
[{"$nulls":3},"Orario","Antiorario"]
[null,"← (180°)",180,null,null,"TOWER300","TOWERA2300",null,null,"A2 (AISI 304)",null,{"$f":"+Trads!$A$345","v":"ZINCATO A CALDO"}]
[null,"↑ (90°)",90,null,null,"TOWER400","TOWERA2400",null,null,"A4 (AISI316)",null,"A2 (AISI 304)"]
[null,"→ (0°)",0,null,null,"TOWER500","TOWERA2500"]
[null,"↓ (270°)",270,null,null,"TOWER600",{"$nulls":8},"PASINT"]
[null,{"$f":"+Trads!$A$332","v":"Angolo"},{"$nulls":3},"TOWER22500",{"$nulls":3},{"$f":"+IF($J$6=Zinc,tower,towera2)","v":"TOWERA2300"},{"$nulls":4},"PASINTA4"]
[null,{"$f":"+Trads!$A$331","v":"Loop"},{"$nulls":7},"TOWERA2400"]
[null,{"$f":"+Trads!$A$330","v":"Fine"},{"$nulls":7},"TOWERA2500",null,{"$f":"+Calculator!J7","v":0}]
[{"$nulls":10},"Intermedio",{"$f":"+Calculator!K5","v":45209}]
[null,{"$f":"+Trads!$A$335","v":"Partenza"},{"$nulls":8},"Angolo",{"$f":"+Calculator!F15","v":0},null,"PATROLINT",{"$f":"+IF(L9=inoxa2,\"PASINT\",\"PASINTA4\")","v":"PASINTA4"}]
[{"$nulls":13},"PATROLMED"]
[null,{"$f":"+Trads!$A$337","v":"Da Supporto #"},{"$nulls":9},{"$f":"+IF(L9=inoxa4,PT,TipSys)","v":"PASSANTE"}]
[{"$nulls":11},"NON PASSANTE"]
[]
[{"$nulls":11},{"$f":"+IF(L10=PT,O11,IntNPT)","v":"PATROLINT"}]
[null,{"$f":"+Dx","v":"→ (0°)"},{"$f":"+down","v":"↓ (270°)"},{"$f":"+sx","v":"← (180°)"},{"$f":"+up","v":"↑ (90°)"},null,"TOPLATE",null,null,{"$f":"+Trads!$A$348","v":"Terminali"},null,"PATROLMED"]
[null,{"$f":"+down","v":"↓ (270°)"},{"$f":"+sx","v":"← (180°)"},{"$f":"+up","v":"↑ (90°)"},{"$f":"+Dx","v":"→ (0°)"},null,"TOPLATE+TOPLATE2",null,null,{"$f":"+Trads!$A$349","v":"Tutti i supporti"}]
[null,{"$f":"+up","v":"↑ (90°)"},{"$f":"+Dx","v":"→ (0°)"},{"$f":"+down","v":"↓ (270°)"},{"$f":"+sx","v":"← (180°)"},null,"TOPLATE2",null,null,{"$f":"+Trads!$A$350","v":"n. supporti"}]
[null,{"$f":"+Angle","v":"Angolo"},{"$f":"+Angle","v":"Angolo"},{"$f":"+Angle","v":"Angolo"},{"$f":"+Angle","v":"Angolo"},null,"TOWERPEAK"]
[null,{"$f":"Loop","v":"Loop"},{"$f":"Loop","v":"Loop"},{"$f":"Loop","v":"Loop"},{"$f":"Loop","v":"Loop"},null,"TOWERSLOPE"]
[null,{"$f":"End","v":"Fine"},{"$f":"End","v":"Fine"},{"$f":"End","v":"Fine"},{"$f":"End","v":"Fine"},null,"TOWLAT",{"$nulls":4},"A2 (AISI 304)"]
[null,270,180,90,0,{"$nulls":6},"A4 (AISI316)"]
[null,90,0,270,180]
[]
[null,"PL-SK-CZ-HU-RO",{"$f":"+Calculator!L27=SupTabella!B26","v":false},{"$nulls":6},"SLIDE1"]
[null,"NL-SE-NO-FI-RU",{"$f":"+Calculator!L27=SupTabella!B27","v":false},{"$nulls":6},"SLIDE2"]
[]
[{"$nulls":9},"SLIDE1A4"]
[null,null,"orario","antiorario","orario","antiorario",{"$nulls":3},"SLIDE2A4"]
[null,"← (180°)",90,270,90,270]
[null,"↑ (90°)",0,180,0,180]
[null,"→ (0°)",0,270,0,90]
[null,"↓ (270°)",180,0,180,0]
[]
[null,34]
[]
[]
[]
[]
[]
[null,"Min"]
[null,"Max",{"$nulls":9},"LimY",null,{"$f":"+J49+L59+L53","v":{"v":5,"d":"5.00"}}]
[]
[{"$nulls":11},{"$f":"IF(Calculator!L35=\"\",M58,IF(N46=FALSE,(M47+N58+N54),M47+N58+N53))","v":{"v":40,"d":"40.00"}},{"$f":"MAX(Calculator!I190:I253)","v":{"v":0,"d":"0.00"}}]
[{"$nulls":11},{"$f":"IFERROR(+ABS((L47-L45)),M58)","v":{"v":80,"d":"80.00"}},{"$f":"IF(ABS(M47-M45)<=0.01,L50,ABS(M47-M45))","v":{"v":0,"d":"0.00"}},{"$f":"IF(M46>K50,TRUE,FALSE)","v":false}]
[null,null,"Area Grafico",{"$nulls":7},{"$f":"+L47<0","v":true},{"$f":"IF(Calculator!L35=\"\",-(M58),_xlfn.FLOOR.MATH(IF(N46=FALSE,M47-L54,M47-L53),L56))","v":{"v":-40,"d":"-40.00"}},{"$f":"MIN(Calculator!I190:I253)","v":{"v":0,"d":"0.00"}}]
[null,null,"LargAreaW",800,"Min",{"$nulls":4},"LimX"]
[null,null,"AltAreaW",800,"Max",{"$nulls":3},{"$f":"+J49<0","v":true},{"$f":"IF(Calculator!L35=\"\",-(M58),(_xlfn.FLOOR.MATH(IF(K51=FALSE,J50-L53,J50-L54),L56)))","v":{"v":-40,"d":"-40.00"}},{"$f":"+IFERROR(ABS(J49-L49),M58)","v":{"v":80,"d":"80.00"}},{"$f":"IF(Calculator!L35=\"\",M58,IF(K51=FALSE,(J50+L58+N53),J50+L58+N54))","v":{"v":40,"d":"40.00"}},null,"Max"]
[{"$nulls":4},"Alt",{"$nulls":4},{"$f":"MIN(Calculator!H190:H253)","v":{"v":0,"d":"0.00"}},{"$f":"IF(ABS(J50-L50)<=0.1,M46,ABS(J50-L50))","v":{"v":0,"d":"0.00"}},{"$f":"MAX(Calculator!H190:H253)","v":{"v":0,"d":"0.0"}},null,{"$f":"+MAX(K50,M46)","v":{"v":0,"d":"0.00"}}]
[{"$nulls":10},{"$f":"+K50>M46","v":false}]
[{"$nulls":11},{"$f":"+L53*I54","v":5}]
[{"$nulls":8},"Rapporto L/H",null,null,5,{"$f":"-L53","v":-5},{"$f":"+L53*O53","v":5},{"$f":"+IF(N50<=M58,1,2)","v":1}]
[{"$nulls":8},{"$f":"IF(M46=0,1,K50/M46)","v":{"v":1,"d":"1.0000"}},null,null,{"$f":"+L53/I54","v":{"v":5,"d":"5.00"}},{"$f":"-L54","v":-5},{"$f":"+L54*O53","v":5}]
[null,null,"Impostazioni",{"$nulls":5},"Larghezz"]
[null,null,"AngEtic",{"$f":"IF(Calculator!Z105=\"\",0,Calculator!Z105)","v":{"v":0,"d":"0 °"}},{"$nulls":6},"Arro",5]
[null,null,"Label#1",{"$f":"_xlfn.IFNA(VLOOKUP(Calculator!X105,C71:D74,2,FALSE),2)","v":2},{"$nulls":8},{"$f":"+AND(L58<M58,N58<M58)","v":true}]
[null,null,"Labels",{"$f":"_xlfn.IFNA(VLOOKUP(Calculator!X103,C71:D74,2,FALSE),2)","v":2},{"$nulls":7},{"$f":"+IF(N46=TRUE,ABS(J50-L50)/I54,ABS(J50-L50))","v":0},40,{"$f":"+IF(K51=TRUE,ABS(M47-M45)*I54,ABS(M47-M45))","v":0}]
[{"$nulls":11},{"$f":"IF(M57=TRUE,M58,IF(N46=TRUE,ABS(J50-L50)/I54,ABS(J50-L50)))","v":{"v":40,"d":"40.00"}},null,{"$f":"+IF(M57=TRUE,M58,IF(K51=TRUE,ABS(M47-M45)*I54,ABS(M47-M45)))","v":{"v":40,"d":"40.00"}}]
[null,null,"AxMinWall",-35,{"$nulls":7},"X",null,"Y"]
[null,null,"AxMaxWall",60,{"$nulls":7},{"$f":"+L59/2","v":{"v":20,"d":"20.00"}},null,{"$f":"+N59/2","v":{"v":20,"d":"20.00"}}]
[null,null,"AyMinWall",-40]
[null,null,"AyMaxWall",25]
[]
[]
[]
[{"$nulls":9},"AyMaxWall",{"$f":"IFERROR(+L45,M58)","v":{"v":40,"d":"40.00"}}]
[]
[]
[]
[null,null,"←",1]
[null,null,"↑",2]
[null,null,"→",3]
[null,null,"↓",4,{"$nulls":5},"AyMinWall",{"$f":"IFERROR(L47,0)","v":{"v":-40,"d":"-40.00"}}]
[{"$nulls":5},"AxMinWall",{"$f":"IFERROR(J49,0)","v":{"v":-40,"d":"-40.00"}},"AxMaxWall",{"$f":"IFERROR(L49,M58)","v":{"v":40,"d":"40.00"}}]

{"sheet":"SupGen","index":3,"n_rows":52,"n_cols":33,"rows_kept":52,"hidden":true,"merged":[[1,16,1,17],[1,18,1,19],[1,21,1,22],[1,23,1,24],[1,25,1,26],[1,27,1,28],[9,13,9,14],[9,21,9,22],[9,23,9,24],[9,25,9,26],[9,27,9,28],[10,21,10,22],[10,23,10,24],[10,25,10,26],[10,27,10,28]]}
[{"$nulls":13},{"$f":"+_xlfn.SEQUENCE(,20)","v":1},2,3,4,5,6,7,8,9,10,11,12,13,14,15,16,17,18,19,20]
[{"$nulls":16},"Operatori",null,"Interasse max",null,"Interasse min","Carico con Interasse Max",null,"Freccia con Interasse Max",null,"Carico con Interasse Min",null,"Freccia con Interasse Min"]
[{"$nulls":6},"A2",null,"A4",{"$nulls":7},"SPEAR","SPEAREVO","SPEAR","SPEAREVO",null,"SPEAR","SPEAREVO","SPEAR","SPEAREVO","SPEAR","SPEAREVO","SPEAR","SPEAREVO"]
[null,{"$f":"+Trads!$A$17","v":"PASSANTE"},{"$nulls":4},"PASINT",null,null,"SPEAR",null,"TOWER300",null,"TOWER / TOWERXL",{"$f":"+Spear","v":"SPEAR"},{"$error":"#N/A"},4,{"$error":"#N/A"},15,{"$error":"#N/A"},2,16.5,{"$error":"#N/A"},3.26,{"$error":"#N/A"},8.2,{"$error":"#N/A"},1.26,{"$error":"#N/A"}]
[null,{"$f":"+Trads!$A$18","v":"NON PASSANTE"},{"$nulls":7},"SPEAREVO",null,"TOWER400",null,"SHIELD / SHIELD2",{"$f":"+Spear","v":"SPEAR"},{"$f":"+Spearevo","v":"SPEAREVO"},2,4,7.5,15,2,17.1,{"$f":"+B52","v":13.7},1.44,{"$f":"+J51","v":3.4},12.5,5.7,0.62,1.35]
[{"$nulls":11},"TOWER500",null,"PATROLEND",{"$f":"+Spear","v":"SPEAR"},{"$f":"+Spearevo","v":"SPEAREVO"},4,4,7.5,15,2,18.1,14,1.3,3.4,14.2,5.7,0.55,1.35]
[{"$nulls":11},"TOWER600",null,"PATROL OVERHEAD","SPEAR",{"$f":"+Spearevo","v":"SPEAREVO"},4,4,7.5,15,2,18.1,14,1.3,3.4,14.2,5.7,0.55,1.35]
[{"$nulls":11},"PATROLEND",null,"PATROL ON WALL",{"$f":"+Spear","v":"SPEAR"},{"$f":"+Spearevo","v":"SPEAREVO"},4,4,7.5,15,2,18.1,14,1.3,3.4,14.2,5.7,0.55,1.35]
[null,{"$f":"+Trads!$A$19","v":"LEGNO"},{"$nulls":9},"PATROL OVERHEAD"]
[null,{"$f":"+Trads!$A$20","v":"CEMENTO"},{"$nulls":9},"PATROL ON WALL",null,"Dal Foglio Calc",null,null,"Operatori",null,"Interassi",null,null,"Carico Max",null,"Freccia Max",null,"Carico Min",null,"Freccia Max"]
[null,{"$f":"+Trads!$A$21","v":"ACCIAIO"},{"$nulls":9},"SHIELD | SHIELD2",null,{"$f":"+Calculator!F9","v":0},{"$f":"+Calculator!F11","v":0},null,{"$f":"IF(O11=Spear,4,5)","v":5},null,{"$f":"IF(O11=Spear,6,7)","v":7},null,null,{"$f":"IF(O11=Spear,9,10)","v":10},null,{"$f":"IF(O11=Spear,11,12)","v":12},null,{"$f":"IF(O11=Spear,13,14)","v":14},null,{"$f":"IF(O11=Spear,15,16)","v":16}]
[]
[{"$nulls":13},"AssorbitoreLista"]
[{"$nulls":13},{"$f":"+VLOOKUP(N11,N4:P8,2,FALSE)","v":{"$error":"#N/A"}}]
[{"$nulls":13},{"$f":"_xlfn.IFNA(VLOOKUP(N11,N4:P8,3,FALSE),\"\")","v":""}]
{"$rows_empty":12}
[{"$nulls":6},"TOWER300","TOWER"]
[{"$nulls":6},"TOWER400","TOWER"]
[{"$nulls":6},"TOWER500","TOWER"]
["PATROL + TOWER + SPEAR",null,"[4UTENTI]",{"$nulls":3},"TOWER","TOWER"]
["CAMPATA (M)","FORZA MASSIMA AL TERMINALE (KN)","FRECCIA CENTRO CAMPATA (M)",{"$nulls":3},"PATROLEND","WALL"]
[15,16.5,3.26,{"$nulls":3},"PATROL OVERHEAD","WALL"]
[2,8.2,1.26,{"$nulls":3},"PATROL ON WALL","WALL"]
["PATROL + SHIELD + SPEAR",null,"[2UTENTI]",{"$nulls":3},"SHIELD | SHIELD2","SHIELD"]
["CAMPATA (M)","FORZA MASSIMA AL TERMINALE (KN)","FRECCIA CENTRO CAMPATA (M)"]
[7.5,17.1,1.44,{"$nulls":3},"MAX",{"$nulls":5},"MIN"]
[2,12.5,0.62,{"$nulls":4},"CAMPATA (M)","FORZA MASSIMA AL TERMINALE (KN)","FRECCIA CENTRO CAMPATA (M)","users",null,null,"CAMPATA (M)","FORZA MASSIMA AL TERMINALE (KN)","FRECCIA CENTRO CAMPATA (M)","users"]
["PATROL + VERTICALE/ORIZZONTALE + SPEAR",null,"[4UTENTI]",{"$nulls":3},"TOWER",15,16.5,3.26,4,null,"TOWER",{"$f":"A34","v":2},{"$f":"B34","v":8.2},{"$f":"C34","v":1.26},4]
["CAMPATA (M)","FORZA MASSIMA AL TERMINALE (KN)","FRECCIA CENTRO CAMPATA (M)",{"$nulls":3},"SHIELD",7.5,17.1,1.44,2,null,"SHIELD",{"$f":"A38","v":2},{"$f":"B38","v":12.5},{"$f":"C38","v":0.62},2]
[7.5,18.1,1.3,{"$nulls":3},"WALL",7.5,18.1,1.3,4,null,"WALL",{"$f":"A42","v":2},{"$f":"B42","v":14.2},{"$f":"C42","v":0.55},4]
[2,14.2,0.55]
[]
[]
[{"$nulls":11},"usati nei calcoli di interpolazione"]
[]
["PATROL + PATROLEND/PAREND + SPEAREVO",null,"[4UTENTI]"]
["CAMPATA (M)","FORZA MASSIMA AL TERMINALE (KN)","FRECCIA CENTRO CAMPATA (M)"]
[15,14,3.4,{"$nulls":4},"CAMPATA (M)","FORZA MASSIMA AL TERMINALE (KN)","FRECCIA CENTRO CAMPATA (M)",{"$nulls":3},"CAMPATA (M)","FORZA MASSIMA AL TERMINALE (KN)","FRECCIA CENTRO CAMPATA (M)"]
["PATROL + SHIELD + SPEAREVO",null,"[4UTENTI]",{"$nulls":3},"WALL",15,14,3.4,4,null,"WALL",2,5.7,1.35,4]
["CAMPATA (M)","FORZA MASSIMA AL TERMINALE (KN)","FRECCIA CENTRO CAMPATA (M)",{"$nulls":3},"SHIELD",15,13.7,3.4,4,null,"SHIELD",2,5.7,1.35,4]
[15,13.7,3.4]

{"sheet":"Dwh_mig","index":4,"n_rows":37,"n_cols":4,"rows_kept":37,"hidden":true}
[]
["Descrizione Indice",{"$f":"+VLOOKUP(Calculator!E5,Dwh_mig!A3:B28,2,FALSE)","v":1},"Codice Lingua Sistema"]
["Italiano",1,1040,"Italiano"]
["čeština",2,1029,"Français"]
["汉语",3,2052,"English"]
["Hrvatski",4,1050,"Español"]
["Français",5,1036,"Deutsch"]
["日本",6,1041]
["Γκρέγκο",7,1032]
["English",8,1033]
["Latvietis",9,1062]
["Polski",10,1045]
["Português",11,2070]
["Română",12,1048]
["Русский",13,1049]
["Slovenčina",14,1051]
["Slovenščina",15,1060]
["Español",16,1034]
["Svenska",17,1053]
["Deutsch",18,1031]
["Türkçe",19,1055]
["Magyar Nyelv",20,1038]
["Português Brasileiro",11,2070]
["",22]
["",23]
["",24]
["",25]
["",26]
[""]
[""]
[""]
[""]
[""]
[""]
[""]
[""]
[""]

{"sheet":"Trads","index":5,"n_rows":1501,"n_cols":5,"rows_kept":1501,"hidden":true}
["Lingua Selezionata","#"]
[{"$f":"+INDEX(Traduzioni,,Dwh_mig!B2)","v":"SUPPORTO"},{"$f":"+_xlfn.SEQUENCE(1499,,2)","v":2},{"$f":"+_xlfn.CONCAT(\"Trads\",B2)","v":"Trads2"},null,{"$f":"+Dwh_mig!B2","v":1}]
["Listino Prezzi",3,{"$f":"+_xlfn.CONCAT(\"Trads\",B3)","v":"Trads3"}]
["Lingua",4,"Trads4"]
["Valuta",5,"Trads5"]
["Rif. Progetto",6,"Trads6"]
["SOTTOSTRUTTURA",7,"Trads7"]
["SUPPORTO PRINCIPALE",8,"Trads8"]
["COMPONENTI",9,"Trads9"]
["TIPO INTERMEDIO",10,"Trads10"]
["INTERMEDIO",11,"Trads11"]
["Codice",12,"Trads12"]
["TIPO ANGOLO",13,"Trads13"]
["TIPO NAVETTA",14,"Trads14"]
["NUMERO DI NAVETTE",15,"Trads15"]
["N. DI NAVETTE PER LINEA VITA",16,"Trads16"]
["PASSANTE",17,"Trads17"]
["NON PASSANTE",18,"Trads18"]
["LEGNO",19,"Trads19"]
["CEMENTO",20,"Trads20"]
["ACCIAIO",21,"Trads21"]
["Descrizione",22,"Trads22"]
["n.",23,"Trads23"]
["Prezzo Lordo",24,"Trads24"]
["Subtotale Lordo",25,"Trads25"]
["Sconto",26,"Trads26"]
["ACCESSORI",27,"Trads27"]
["TIPO DI SCALA",28,"Trads28"]
["Normativa",29,"Trads29"]
["CON GABBIA",30,"Trads30"]
["SENZA GABBIA",31,"Trads31"]
["NO",32,"Trads32"]
["SI",33,"Trads33"]
["Prezzo Netto",34,"Trads34"]
["ALTEZZA ALLO SBARCO",35,"Trads35"]
["PROFONDITA' STAFFE",36,"Trads36"]
["PROTEZIONE FINALE ",37,"Trads37"]
["ESTENSIONE RIMOVIBILE",38,"Trads38"]
["PEDANA DI SBARCO",39,"Trads39"]
["SBARCO 500x500",40,"Trads40"]
["SBARCO 500x750",41,"Trads41"]
["PROTEZIONE SBARCO",42,"Trads42"]
["PEDANA DI RIPOSO",43,"Trads43"]
["PEDANA RIBALTABILE",44,"Trads44"]
["RIBALTABILE PER LV VERTICALE",45,"Trads45"]
["NORMATIVA PEDANA",46,"Trads46"]
["BOTOLA DI CHIUSURA",47,"Trads47"]
["TIPO PIEDINI",48,"Trads48"]
["PIEDINI REGOLABILI",49,"Trads49"]
["PIEDINI SNODATI",50,"Trads50"]
["GANCIO PER SCALE",51,"Trads51"]
["MANIGLIONI",52,"Trads52"]
["MODULI SCALE",53,"Trads53"]
["PZ",54,"Trads54"]
["Gruppo",55,"Trads55"]
["ASTE GABBIA",56,"Trads56"]
["ANELLI",57,"Trads57"]
["STAFFE",58,"Trads58"]
["GIUNZIONI",59,"Trads59"]
["TAPPI",60,"Trads60"]
["TARGHETTA",61,"Trads61"]
["FISSAGGI",62,"Trads62"]
["FISSAGGI STAFFE",63,"Trads63"]
["FISSAGGIO INTERMEDIO",64,"Trads64"]
["LINGUA TARGHETTA",65,"Trads65"]
["ESTENSIONE SUPERIORE",66,"Trads66"]
["INTERASSE INTERMEDI",67,{"$f":"+_xlfn.CONCAT(\"Trads\",B67)","v":"Trads67"}]
["INTERASSE 5 MT (SUGGERITO)",68,"Trads68"]
["NESSUN INTERMEDIO",69,"Trads69"]
["N.1 INTERMEDIO",70,"Trads70"]
["N.2 INTERMEDIO",71,"Trads71"]
["N.3 INTERMEDIO",72,"Trads72"]
["N.4 INTERMEDIO",73,"Trads73"]
["N.5 INTERMEDIO",74,"Trads74"]
["NAVETTA INCLUSA",75,"Trads75"]
["MANIGLIE",76,"Trads76"]
["FISSAGGIO ALLA BASE",77,"Trads77"]
["RINFORZO PER SCALE",78,"Trads78"]
["Totale",79,"Trads79"]
["Totale prezzo Netto",80,"Trads80"]
["Info Cliente",81,"Trads81"]
["Numero Cliente",82,"Trads82"]
["Codice Semiramis",83,"Trads83"]
["Nome Cliente",84,"Trads84"]
["Email ",85,"Trads85"]
["Telefono",86,"Trads86"]
["Sito Web",87,"Trads87"]
["Tecnico Commerciale",88,"Trads88"]
["Partita IVA",89,"Trads89"]
["Codice IBAN",90,"Trads90"]
["Codice SWIFT",91,"Trads91"]
["Indirizzo Fatturazione",92,"Trads92"]
["Via",93,"Trads93"]
["Città",94,"Trads94"]
["CAP",95,"Trads95"]
["Nazione",96,"Trads96"]
["Provincia",97,"Trads97"]
["Indirizzo per la Spedizione",98,"Trads98"]
["Listino Prezzi e Valuta",99,"Trads99"]
["Fatturato",100,"Trads100"]
["LINEA PRODOTTO",101,"Trads101"]
["PUNTI SINGOLI ",102,"Trads102"]
["LINEE VITA",103,"Trads103"]
["SUPPORTI",104,"Trads104"]
["COMPONENTI LINEE VITA",105,"Trads105"]
["ANTICADUTA",106,"Trads106"]
["PROTEZIONI COLLETTIVE",107,"Trads107"]
["DPI - DISPOSITIVI DI PROTEZIONE INDIVIDUALE",108,"Trads108"]
["ALTRE LINEE VITA",109,"Trads109"]
["CAVO IN ACCIAIO",110,"Trads110"]
["Tasso di cambio:",111,"Trads111"]
["Pagamento ",112,"Trads112"]
["ORDINE",113,"Trads113"]
["Rif.",114,"Trads114"]
["Data",115,"Trads115"]
["Cellulare",116,"Trads116"]
["Persona di riferimento",117,"Trads117"]
["Linea",118,"Trads118"]
["Qt.",119,"Trads119"]
["Subtotale",120,"Trads120"]
["Peso",121,"Trads121"]
["Note",122,"Trads122"]
["Cliente",123,"Trads123"]
["RETI DI SICUREZZA",124,"Trads124"]
["PARAPETTI",125,"Trads125"]
["GANCI SCALE",126,"Trads126"]
["CASCHI",127,"Trads127"]
["IMBRACHI",128,"Trads128"]
["CORDINI",129,"Trads129"]
["DISCENSORI",130,"Trads130"]
["RETRATTILI",131,{"$f":"+_xlfn.CONCAT(\"Trads\",B131)","v":"Trads131"}]
["POSIZIONAMENTO",132,"Trads132"]
["ANCORANTI",133,"Trads133"]
["CONNETTORI",134,"Trads134"]
["TRIPODI",135,"Trads135"]
["BIPODI",136,"Trads136"]
["GUANTI",137,"Trads137"]
["ORECCHIE",138,"Trads138"]
["OCCHI",139,"Trads139"]
["FISSAGGI",140,"Trads140"]
["SITEMI DI FISSAGGIO",141,"Trads141"]
["Corrimano",142,"Trads142"]
["Dritto",143,"Trads143"]
["Inclinato",144,"Trads144"]
["Tavola Fermapiede",145,"Trads145"]
["Prezzo Listino/ml",146,"Trads146"]
["Lingua",147,"Trads147"]
["AUTOPORTANTE",148,"Trads148"]
["Montante",149,"Trads149"]
["Diritto",150,"Trads150"]
["Corrente",151,"Trads151"]
["Altezza Montante",152,"Trads152"]
["Normativa di riferimento",153,"Trads153"]
["Composizione Parapetto",154,"Trads154"]
["Lunghezza totale parapetto",155,"Trads155"]
["Angoli",156,"Trads156"]
["Fissaggi a muro",157,"Trads157"]
["Terminali non a muro",158,"Trads158"]
["Kit cancelletto",159,"Trads159"]
["Versione Alu",160,"Trads160"]
["Tipo Montante",161,"Trads161"]
["Arrodondamento ml",162,"Trads162"]
["Interasse Montanti",163,"Trads163"]
["N. montanti",164,"Trads164"]
["Input n. montanti",165,"Trads165"]
["Larghezza",166,"Trads166"]
["Peso Totale",167,"Trads167"]
["Costo Gestione Ordine",168,"Trads168"]
["Totale Prezzo Lordo",169,"Trads169"]
["Costo di trasporto",170,"Trads170"]
["Prezzo Netto/ml",171,"Trads171"]
["Costo Materiale + trasporto e gestione",172,"Trads172"]
["Costo Materiale + altre spese/ml",173,"Trads173"]
["Kit Impermeabilizzazione",174,"Trads174"]
["% Cuneo spessore/montanti",175,"Trads175"]
["Distanza Extra",176,"Trads176"]
["Tipo Base Verticale",177,"Trads177"]
["Dati Progetti",178,"Trads178"]
["Versione Plastica",179,"Trads179"]
["Cartaceo",180,"Trads180"]
["Online",181,"Trads181"]
["Manuale",182,"Trads182"]
["da spedire",183,"Trads183"]
["Interasse greche pannello",184,"Trads184"]
["Fissaggi Inclusi",185,"Trads185"]
["Rondella in EPDM",186,"Trads186"]
["TIPO DI CHIUSURA",187,"Trads187"]
["PORTA DI CHIUSURA",188,"Trads188"]
["SCALA SGANCIABILE",189,"Trads189"]
["Parallela alle greche",190,"Trads190"]
["Perpendicolare alle greche",191,"Trads191"]
["SISTEMA DI RIPOSO",192,"Trads192"]
["MODULO DI SDOPPIAMENTO",193,"Trads193"]
["DESTRA",194,"Trads194"]
["SINISTRA",195,{"$f":"+_xlfn.CONCAT(\"Trads\",B195)","v":"Trads195"}]
["DIREZIONE PRIMO SDOPPIAMENTO",196,"Trads196"]
["PRIMO MODULO REMOVIBILE",197,"Trads197"]
["TIPO VERSIONE ACCIAIO",198,"Trads198"]
["ACCIAIO INOX A2",199,"Trads199"]
["ACCIAIO INOX A4",200,"Trads200"]
["RIMOVIBILE",201,"Trads201"]
["FISSO",202,"Trads202"]
["INTERMEDIO PASSANTE",203,"Trads203"]
["ALTEZZA NON SUFFICIENTE",204,"Trads204"]
["DETTAGLI",205,"Trads205"]
["CON PROTEZIONE",206,"Trads206"]
["Attenzione: senza estensione finale",207,"Trads207"]
["TRATTO FINALE",208,"Trads208"]
["ULTIMO SDOPPIAMENTO",209,"Trads209"]
["TRATTI INTERMEDI",210,"Trads210"]
["SDOPPIAMENTI INTERMEDI",211,"Trads211"]
["TRATTO INIZIALE",212,"Trads212"]
["Opzione Base",213,"Trads213"]
["ALTEZZA DA PIANO DI SBARCO",214,"Trads214"]
["Dati Progetto Insufficienti!!!",215,"Trads215"]
["Spessore Isolamento",216,"Trads216"]
["CANCELLA TUTTO",217,"Trads217"]
["LA VALUTA DELLA FATTURA E' IN",218,"Trads218"]
["LA VALUTA LOCALE E' SOLO INDICATIVA",219,"Trads219"]
["SISTEMI ANTICADUTA",220,"Trads220"]
["LINEE VITA E SISTEMA BINARIO",221,"Trads221"]
["PUNTI SINGOLI ",222,"Trads222"]
["SUPPORTI E ACCESSORI",223,"Trads223"]
["Singolo articolo",224,"Trads224"]
["Gruppo prodotto",225,"Trads225"]
["Condizioni di pagamento",226,"Trads226"]
["Firma TS",227,"Trads227"]
["Firma ASM",228,"Trads228"]
["Firma Cliente",229,"Trads229"]
["Compila il campo nel foglio CRM",230,"Trads230"]
["FISSAGGI",231,"Trads231"]
["SISTEMI DI FISSAGGIO",232,"Trads232"]
["TENUTA ALL'ARIA E IMPERMEABILIZZAZIONE",233,"Trads233"]
["MEMBRANE E FRENI AL VAPORE, NASTRI, ACCESSORI",234,"Trads234"]
["DISPOSITIVI TEMPORANEI",235,"Trads235"]
["FUNE",236,"Trads236"]
["LINEA VITA NON RB",237,"Trads237"]
["PUNTI D'ANCORAGGIO NON RB",238,"Trads238"]
["RETI ANTICADUTA TEMPORANEE",239,"Trads239"]
["ALTRO",240,"Trads240"]
["CASCHI",241,"Trads241"]
["IMBRACATURE",242,"Trads242"]
["ANTICADUTA",243,"Trads243"]
["POSIZIONAMENTO",244,"Trads244"]
["DISCENSORI / SISTEMI DI RISALITA",245,"Trads245"]
["KIT",246,"Trads246"]
["CORDE",247,"Trads247"]
["DISPOSITIVI RETRATTILI",248,"Trads248"]
["ANCORAGGI TEMPORANEI",249,"Trads249"]
["CONNETTORI",250,"Trads250"]
["CARRUCOLE",251,"Trads251"]
["TRIPODI",252,"Trads252"]
["GRU",253,"Trads253"]
["E",254,"Trads254"]
["ANCORANTE AVVITABILE",255,"Trads255"]
["TASSELLI MECCANICI",256,"Trads256"]
["RESINE E COLLE",257,"Trads257"]
["BARRE FILETTATE",258,"Trads258"]
["DOPPIO TRAFILATO SU MISURA",259,{"$f":"+_xlfn.CONCAT(\"Trads\",B259)","v":"Trads259"}]
["CONTROVENTO",260,"Trads260"]
["% Viti a grano in più",261,"Trads261"]
["PROFONDITA' OSTACOLO",262,"Trads262"]
["SPESSORE CORDOLO",263,"Trads263"]
["SCALETTA DI DISCESA",264,"Trads264"]
["(E) Maggiore di 450 mm",265,"Trads265"]
["Minore di",266,"Trads266"]
["Su richiesta SBARCO maggiore di 750 mm",267,"Trads267"]
["Su richiesta",268,"Trads268"]
["Opzione Default",269,"Trads269"]
["Necessaria protezione",270,"Trads270"]
["Forma",271,"Trads271"]
["Rettangolare",272,"Trads272"]
["Circolare",273,"Trads273"]
["Raggio",274,"Trads274"]
["Larghezza",275,"Trads275"]
["Lunghezza",276,"Trads276"]
["Superficie (mq)",277,"Trads277"]
["Codice per richiesta",278,"Trads278"]
["Dimensioni",279,"Trads279"]
["Superficie Totale (mq)",280,"Trads280"]
["Superficie Subtotale (mq)",281,"Trads281"]
["Prezzo Listino/mq",282,"Trads282"]
["Prezzo Netto/mq",283,"Trads283"]
["Costo Materiale + altre spese/mq",284,"Trads284"]
["Tipo Installazione",285,"Trads285"]
["Schema",286,"Trads286"]
["Listello 40x50 mm",287,"Trads287"]
["Omega \"L\" 30x30x2 mm",288,"Trads288"]
["LBB4030 40x3 mm",289,"Trads289"]
["Accessorio di Fissaggio",290,"Trads290"]
["PRODOTTO SU RICHIESTA",291,"Trads291"]
["TIPO DI SISTEMA",292,"Trads292"]
["Altezza Supporto",293,"Trads293"]
["Scaletta",294,"Trads294"]
["Con ancoranti",295,"Trads295"]
["Con zavorra",296,"Trads296"]
["Piano + parapetti",297,"Trads297"]
["Utile",298,"Trads298"]
["Altezza",299,"Trads299"]
["Linea Vita Orizzontale",300,"Trads300"]
["Scalini",301,"Trads301"]
["Compilare",302,"Trads302"]
["Materiale",303,"Trads303"]
["Su copertura con Shed",304,"Trads304"]
["Su copertura piana",305,"Trads305"]
["Su copertura con pannelli sandwich",306,"Trads306"]
["Freccia/altezza Shed",307,"Trads307"]
["Interasse Travi Y",308,"Trads308"]
["Direzione Passerella",309,"Trads309"]
["Distanziamento da muro",310,"Trads310"]
["Interasse mensole",311,"Trads311"]
["Accesso laterale",312,"Trads312"]
["Accesso frontale",313,"Trads313"]
["Parapetti Laterali",314,"Trads314"]
["Singolo lato",315,"Trads315"]
["Entrambi i lati",316,"Trads316"]
["Tipo Accesso",317,"Trads317"]
["Shed",318,"Trads318"]
["ALTEZZA TOTALE SCALA",319,"Trads319"]
["PENULTIMO TRATTO INTERMEDIO",320,"Trads320"]
["SDOPPIAMENTO ",321,"Trads321"]
["CANCELLETTO DI SBARCO",322,"Trads322"]
["FISSAGGIO SU LAMIERA",323,{"$f":"+_xlfn.CONCAT(\"Trads\",B323)","v":"Trads323"}]
["DOPPIA CHIUSURA",324,"Trads324"]
["GRADINO DI USCITA",325,"Trads325"]
["IMPERMEABILIZZAZIONE",326,"Trads326"]
["NUMERO DI ACCESSI",327,"Trads327"]
["TRASPORTO E GESTIONE",328,"Trads328"]
["NASCONDI/SCOPRI CODICI",329,"Trads329"]
["Fine",330,"Trads330"]
["Loop",331,"Trads331"]
["Angolo",332,"Trads332"]
["Coordinate",333,"Trads333"]
["Posizione Supporto #",334,"Trads334"]
["Partenza",335,"Trads335"]
["Partenza Condivisa",336,"Trads336"]
["Da Supporto #",337,"Trads337"]
["A Supporto #",338,"Trads338"]
["Direzione",339,"Trads339"]
["Lunghezza",340,"Trads340"]
["Angolo°",341,"Trads341"]
["Lunghezza misurata",342,"Trads342"]
["Partenza dall'ultimo",343,"Trads343"]
["Attenzione al numero montanti",344,"Trads344"]
["ZINCATO A CALDO",345,"Trads345"]
["Arrivo e Ripartenza",346,"Trads346"]
["Esporta E-Service/Margin",347,"Trads347"]
["Terminali",348,"Trads348"]
["Tutti i supporti",349,"Trads349"]
["n. supporti",350,"Trads350"]
["Materiale Navetta",351,"Trads351"]
["Copia Sconto",352,"Trads352"]
["SISTEMA NON COMPLETO DEI TERMINALI",353,"Trads353"]
["X-LAM",354,"Trads354"]
["CEMENTO ALVEOLARE",355,"Trads355"]
["LAMIERA TRAPEZOIDALE",356,"Trads356"]
["Spessori Minimi",357,"Trads357"]
["METODO DI LAVORO",358,"Trads358"]
["SOSPENSIONE ",359,"Trads359"]
["ANTICADUTA",360,"Trads360"]
["TRATTENUTA",361,"Trads361"]
["Esterno",362,"Trads362"]
["Interno",363,"Trads363"]
["DOPPIA APERTURA",364,"Trads364"]
["Posizione Etichetta",365,"Trads365"]
["Angolo Etichetta",366,"Trads366"]
["CANCELLA DISEGNO",367,"Trads367"]
["Posizione Etichette",368,"Trads368"]
["fissaggi non inclusi",369,"Trads369"]
["vite",370,"Trads370"]
["bullone",371,"Trads371"]
["Stampa",372,"Trads372"]
["Relazione Tecnica",373,"Trads373"]
[0,374,"Trads374"]
[0,375,"Trads375"]
[0,376,"Trads376"]
[0,377,"Trads377"]
[0,378,"Trads378"]
[0,379,"Trads379"]
[0,380,"Trads380"]
[0,381,"Trads381"]
[0,382,"Trads382"]
[0,383,"Trads383"]
[0,384,"Trads384"]
[0,385,"Trads385"]
[0,386,"Trads386"]
[0,387,{"$f":"+_xlfn.CONCAT(\"Trads\",B387)","v":"Trads387"}]
[0,388,"Trads388"]
[0,389,"Trads389"]
[0,390,"Trads390"]
[0,391,"Trads391"]
[0,392,"Trads392"]
[0,393,"Trads393"]
[0,394,"Trads394"]
[0,395,"Trads395"]
[0,396,"Trads396"]
[0,397,"Trads397"]
[0,398,"Trads398"]
[0,399,"Trads399"]
[0,400,"Trads400"]
[0,401,"Trads401"]
[0,402,"Trads402"]
[0,403,"Trads403"]
[0,404,"Trads404"]
[0,405,"Trads405"]
[0,406,"Trads406"]
[0,407,"Trads407"]
[0,408,"Trads408"]
[0,409,"Trads409"]
[0,410,"Trads410"]
[0,411,"Trads411"]
[0,412,"Trads412"]
[0,413,"Trads413"]
[0,414,"Trads414"]
[0,415,"Trads415"]
[0,416,"Trads416"]
[0,417,"Trads417"]
[0,418,"Trads418"]
[0,419,"Trads419"]
[0,420,"Trads420"]
[0,421,"Trads421"]
[0,422,"Trads422"]
[0,423,"Trads423"]
[0,424,"Trads424"]
[0,425,"Trads425"]
[0,426,"Trads426"]
[0,427,"Trads427"]
[0,428,"Trads428"]
[0,429,"Trads429"]
[0,430,"Trads430"]
[0,431,"Trads431"]
[0,432,"Trads432"]
[0,433,"Trads433"]
[0,434,"Trads434"]
[0,435,"Trads435"]
[0,436,"Trads436"]
[0,437,"Trads437"]
[0,438,"Trads438"]
[0,439,"Trads439"]
[0,440,"Trads440"]
[0,441,"Trads441"]
[0,442,"Trads442"]
[0,443,"Trads443"]
[0,444,"Trads444"]
[0,445,"Trads445"]
[0,446,"Trads446"]
[0,447,"Trads447"]
[0,448,"Trads448"]
[0,449,"Trads449"]
[0,450,"Trads450"]
[0,451,{"$f":"+_xlfn.CONCAT(\"Trads\",B451)","v":"Trads451"}]
[0,452,"Trads452"]
[0,453,"Trads453"]
[0,454,"Trads454"]
[0,455,"Trads455"]
[0,456,"Trads456"]
[0,457,"Trads457"]
[0,458,"Trads458"]
[0,459,"Trads459"]
[0,460,"Trads460"]
[0,461,"Trads461"]
[0,462,"Trads462"]
[0,463,"Trads463"]
[0,464,"Trads464"]
[0,465,"Trads465"]
[0,466,"Trads466"]
[0,467,"Trads467"]
[0,468,"Trads468"]
[0,469,"Trads469"]
[0,470,"Trads470"]
[0,471,"Trads471"]
[0,472,"Trads472"]
[0,473,"Trads473"]
[0,474,"Trads474"]
[0,475,"Trads475"]
[0,476,"Trads476"]
[0,477,"Trads477"]
[0,478,"Trads478"]
[0,479,"Trads479"]
[0,480,"Trads480"]
[0,481,"Trads481"]
[0,482,"Trads482"]
[0,483,"Trads483"]
[0,484,"Trads484"]
[0,485,"Trads485"]
[0,486,"Trads486"]
[0,487,"Trads487"]
[0,488,"Trads488"]
[0,489,"Trads489"]
[0,490,"Trads490"]
[0,491,"Trads491"]
[0,492,"Trads492"]
[0,493,"Trads493"]
[0,494,"Trads494"]
[0,495,"Trads495"]
[0,496,"Trads496"]
[0,497,"Trads497"]
[0,498,"Trads498"]
[0,499,"Trads499"]
[0,500,"Trads500"]
[0,501,"Trads501"]
[0,502,"Trads502"]
[0,503,"Trads503"]
[0,504,"Trads504"]
[0,505,"Trads505"]
[0,506,"Trads506"]
[0,507,"Trads507"]
[0,508,"Trads508"]
[0,509,"Trads509"]
[0,510,"Trads510"]
[0,511,"Trads511"]
[0,512,"Trads512"]
[0,513,"Trads513"]
[0,514,"Trads514"]
[0,515,{"$f":"+_xlfn.CONCAT(\"Trads\",B515)","v":"Trads515"}]
[0,516,"Trads516"]
[0,517,"Trads517"]
[0,518,"Trads518"]
[0,519,"Trads519"]
[0,520,"Trads520"]
[0,521,"Trads521"]
[0,522,"Trads522"]
[0,523,"Trads523"]
[0,524,"Trads524"]
[0,525,"Trads525"]
[0,526,"Trads526"]
[0,527,"Trads527"]
[0,528,"Trads528"]
[0,529,"Trads529"]
[0,530,"Trads530"]
[0,531,"Trads531"]
[0,532,"Trads532"]
[0,533,"Trads533"]
[0,534,"Trads534"]
[0,535,"Trads535"]
[0,536,"Trads536"]
[0,537,"Trads537"]
[0,538,"Trads538"]
[0,539,"Trads539"]
[0,540,"Trads540"]
[0,541,"Trads541"]
[0,542,"Trads542"]
[0,543,"Trads543"]
[0,544,"Trads544"]
[0,545,"Trads545"]
[0,546,"Trads546"]
[0,547,"Trads547"]
[0,548,"Trads548"]
[0,549,"Trads549"]
[0,550,"Trads550"]
[0,551,"Trads551"]
[0,552,"Trads552"]
[0,553,"Trads553"]
[0,554,"Trads554"]
[0,555,"Trads555"]
[0,556,"Trads556"]
[0,557,"Trads557"]
[0,558,"Trads558"]
[0,559,"Trads559"]
[0,560,"Trads560"]
[0,561,"Trads561"]
[0,562,"Trads562"]
[0,563,"Trads563"]
[0,564,"Trads564"]
[0,565,"Trads565"]
[0,566,"Trads566"]
[0,567,"Trads567"]
[0,568,"Trads568"]
[0,569,"Trads569"]
[0,570,"Trads570"]
[0,571,"Trads571"]
[0,572,"Trads572"]
[0,573,"Trads573"]
[0,574,"Trads574"]
[0,575,"Trads575"]
[0,576,"Trads576"]
[0,577,"Trads577"]
[0,578,"Trads578"]
[0,579,{"$f":"+_xlfn.CONCAT(\"Trads\",B579)","v":"Trads579"}]
[0,580,"Trads580"]
[0,581,"Trads581"]
[0,582,"Trads582"]
[0,583,"Trads583"]
[0,584,"Trads584"]
[0,585,"Trads585"]
[0,586,"Trads586"]
[0,587,"Trads587"]
[0,588,"Trads588"]
[0,589,"Trads589"]
[0,590,"Trads590"]
[0,591,"Trads591"]
[0,592,"Trads592"]
[0,593,"Trads593"]
[0,594,"Trads594"]
[0,595,"Trads595"]
[0,596,"Trads596"]
[0,597,"Trads597"]
[0,598,"Trads598"]
[0,599,"Trads599"]
[0,600,"Trads600"]
["Calcolo del sistema linea vita \"PATROL\"",601,"Trads601"]
["Forze e deformazione del sistema",602,"Trads602"]
["Assorbitore-tensionatore",603,"Trads603"]
["Non è consigliabile avere una linea di vita con angoli inferiori a 90°. In questi casi, si raccomanda di dividere la linea di vita in quel punto.",604,"Trads604"]
["Numero max di utenti",605,"Trads605"]
["Carichi da manuale di installazione (EN795)",606,"Trads606"]
["Interasse",607,"Trads607"]
["Flessione massima Cavo",608,"Trads608"]
["Fmax",609,"Trads609"]
["Lunghezza massima campata",610,"Trads610"]
["Carico applicato alla campata all'interno di questo segmento",611,"Trads611"]
["Reazione sugli elementi di ancoraggio della fune a più campate",612,"Trads612"]
["Curva",613,"Trads613"]
["Carico massimo di progetto",614,"Trads614"]
["Freccia della fune della campata rispetto ai vincoli delle estremità di giunzione",615,"Trads615"]
["Campata caricata",616,"Trads616"]
["Freccia",617,"Trads617"]
["Modulo",618,"Trads618"]
[" m per l'allungamento della fune già considerato",619,"Trads619"]
["Non è consigliabile avere una linea di vita con angoli inferiori a 90°. In questi casi, si raccomanda di dividere la linea di vita in quel punto.",620,"Trads620"]
["Disegnare i segmenti della linea di vita",621,"Trads621"]
["I fissaggi e gli ancoraggi devono essere gli stessi in tutti i punti di ancoraggio.",622,"Trads622"]
["Prima della costruzione, tutti i calcoli devono essere verificati e approvati dal progettista responsabile.",623,"Trads623"]
["NOTE",624,"Trads624"]
["I valori di resistenza meccanica e la geometria si riferiscono alla certificazione del prodotto.",625,"Trads625"]
["La verifica della resistenza dei sistemi di ancoraggio deve essere realizzata a parte.",626,"Trads626"]
["Tutti i calcoli devono essere verificati e approvati dal progettista responsabile prima dell'esecuzione. Il progettista è tenuto a verificare, ad ogni utilizzo, la conformità dei dati alle normative vigenti e al progetto. La responsabilità ultima della scelta del prodotto appropriato per una specifica applicazione spetta al progettista.",627,"Trads627"]
["I risultati ottenuti in questa scheda sono di natura indicativa e vanno considerati come un servizio tecnico-commerciale nell'ambito dell'attività di vendita di Rotho Blaas srl. Il numero e lo spessore degli inserti devono essere determinati dal progettista responsabile che è tenuto a verificare l'esattezza dei risultati derivanti dall'elaborazione dei dati inseriti. Rotho Blaas srl non garantisce la conformità alla normativa vigente e la progettazione dei calcoli effettuati tramite questo foglio di calcolo. In particolare, in seguito alla modifica delle disposizioni pertinenti, quali ad esempio norme, approvazioni, ecc. il programma potrebbe diventare, in parte o in toto, non valido. Rotho Blaas srl non garantisce e non sarà responsabile per danni o conseguenze dirette o indirette o altro, in qualsiasi modo (garanzia per difetti, garanzia per malfunzionamento, responsabilità del prodotto o legale, ecc.) L'Utente dichiara di utilizzare il foglio di calcolo in qualità di professionista con l'obbligo e la responsabilità di verificare che il foglio di calcolo risponda alle sue specifiche esigenze.",628,"Trads628"]
["ancoraggi alla campata caricata",629,"Trads629"]
["ancoraggi alla campata non caricata",630,"Trads630"]
["Intermedio Tratto",631,"Trads631"]
["Termine la linea vita con Fine o Loop",632,"Trads632"]
["sul Desktop",633,"Trads633"]
[0,634,"Trads634"]
[0,635,"Trads635"]
[0,636,"Trads636"]
[0,637,"Trads637"]
[0,638,"Trads638"]
[0,639,"Trads639"]
[0,640,"Trads640"]
[0,641,"Trads641"]
[0,642,"Trads642"]
[0,643,{"$f":"+_xlfn.CONCAT(\"Trads\",B643)","v":"Trads643"}]
[0,644,"Trads644"]
[0,645,"Trads645"]
[0,646,"Trads646"]
[0,647,"Trads647"]
[0,648,"Trads648"]
[0,649,"Trads649"]
[0,650,"Trads650"]
[0,651,"Trads651"]
[0,652,"Trads652"]
[0,653,"Trads653"]
[0,654,"Trads654"]
[0,655,"Trads655"]
[0,656,"Trads656"]
[0,657,"Trads657"]
[0,658,"Trads658"]
[0,659,"Trads659"]
[0,660,"Trads660"]
[0,661,"Trads661"]
[0,662,"Trads662"]
[0,663,"Trads663"]
[0,664,"Trads664"]
[0,665,"Trads665"]
[0,666,"Trads666"]
[0,667,"Trads667"]
[0,668,"Trads668"]
[0,669,"Trads669"]
[0,670,"Trads670"]
[0,671,"Trads671"]
[0,672,"Trads672"]
[0,673,"Trads673"]
[0,674,"Trads674"]
[0,675,"Trads675"]
[0,676,"Trads676"]
[0,677,"Trads677"]
[0,678,"Trads678"]
[0,679,"Trads679"]
[0,680,"Trads680"]
[0,681,"Trads681"]
[0,682,"Trads682"]
[0,683,"Trads683"]
[0,684,"Trads684"]
[0,685,"Trads685"]
[0,686,"Trads686"]
[0,687,"Trads687"]
[0,688,"Trads688"]
[0,689,"Trads689"]
[0,690,"Trads690"]
[0,691,"Trads691"]
[0,692,"Trads692"]
[0,693,"Trads693"]
[0,694,"Trads694"]
[0,695,"Trads695"]
[0,696,"Trads696"]
[0,697,"Trads697"]
[0,698,"Trads698"]
[0,699,"Trads699"]
[0,700,"Trads700"]
[0,701,"Trads701"]
[0,702,"Trads702"]
[0,703,"Trads703"]
[0,704,"Trads704"]
[0,705,"Trads705"]
[0,706,"Trads706"]
[0,707,{"$f":"+_xlfn.CONCAT(\"Trads\",B707)","v":"Trads707"}]
[0,708,"Trads708"]
[0,709,"Trads709"]
[0,710,"Trads710"]
[0,711,"Trads711"]
[0,712,"Trads712"]
[0,713,"Trads713"]
[0,714,"Trads714"]
[0,715,"Trads715"]
[0,716,"Trads716"]
[0,717,"Trads717"]
[0,718,"Trads718"]
[0,719,"Trads719"]
[0,720,"Trads720"]
[0,721,"Trads721"]
[0,722,"Trads722"]
[0,723,"Trads723"]
[0,724,"Trads724"]
[0,725,"Trads725"]
[0,726,"Trads726"]
[0,727,"Trads727"]
[0,728,"Trads728"]
[0,729,"Trads729"]
[0,730,"Trads730"]
[0,731,"Trads731"]
[0,732,"Trads732"]
[0,733,"Trads733"]
[0,734,"Trads734"]
[0,735,"Trads735"]
[0,736,"Trads736"]
[0,737,"Trads737"]
[0,738,"Trads738"]
[0,739,"Trads739"]
[0,740,"Trads740"]
[0,741,"Trads741"]
[0,742,"Trads742"]
[0,743,"Trads743"]
[0,744,"Trads744"]
[0,745,"Trads745"]
[0,746,"Trads746"]
[0,747,"Trads747"]
[0,748,"Trads748"]
[0,749,"Trads749"]
[0,750,"Trads750"]
[0,751,"Trads751"]
[0,752,"Trads752"]
[0,753,"Trads753"]
[0,754,"Trads754"]
[0,755,"Trads755"]
[0,756,"Trads756"]
[0,757,"Trads757"]
[0,758,"Trads758"]
[0,759,"Trads759"]
[0,760,"Trads760"]
[0,761,"Trads761"]
[0,762,"Trads762"]
[0,763,"Trads763"]
[0,764,"Trads764"]
[0,765,"Trads765"]
[0,766,"Trads766"]
[0,767,"Trads767"]
[0,768,"Trads768"]
[0,769,"Trads769"]
[0,770,"Trads770"]
[0,771,{"$f":"+_xlfn.CONCAT(\"Trads\",B771)","v":"Trads771"}]
[0,772,"Trads772"]
[0,773,"Trads773"]
[0,774,"Trads774"]
[0,775,"Trads775"]
[0,776,"Trads776"]
[0,777,"Trads777"]
[0,778,"Trads778"]
[0,779,"Trads779"]
[0,780,"Trads780"]
[0,781,"Trads781"]
[0,782,"Trads782"]
[0,783,"Trads783"]
[0,784,"Trads784"]
[0,785,"Trads785"]
[0,786,"Trads786"]
[0,787,"Trads787"]
[0,788,"Trads788"]
[0,789,"Trads789"]
[0,790,"Trads790"]
[0,791,"Trads791"]
[0,792,"Trads792"]
[0,793,"Trads793"]
[0,794,"Trads794"]
[0,795,"Trads795"]
[0,796,"Trads796"]
[0,797,"Trads797"]
[0,798,"Trads798"]
[0,799,"Trads799"]
[0,800,"Trads800"]
[0,801,"Trads801"]
[0,802,"Trads802"]
[0,803,"Trads803"]
[0,804,"Trads804"]
[0,805,"Trads805"]
[0,806,"Trads806"]
[0,807,"Trads807"]
[0,808,"Trads808"]
[0,809,"Trads809"]
[0,810,"Trads810"]
[0,811,"Trads811"]
[0,812,"Trads812"]
[0,813,"Trads813"]
[0,814,"Trads814"]
[0,815,"Trads815"]
[0,816,"Trads816"]
[0,817,"Trads817"]
[0,818,"Trads818"]
[0,819,"Trads819"]
[0,820,"Trads820"]
[0,821,"Trads821"]
[0,822,"Trads822"]
[0,823,"Trads823"]
[0,824,"Trads824"]
[0,825,"Trads825"]
[0,826,"Trads826"]
[0,827,"Trads827"]
[0,828,"Trads828"]
[0,829,"Trads829"]
[0,830,"Trads830"]
[0,831,"Trads831"]
[0,832,"Trads832"]
[0,833,"Trads833"]
[0,834,"Trads834"]
[0,835,{"$f":"+_xlfn.CONCAT(\"Trads\",B835)","v":"Trads835"}]
[0,836,"Trads836"]
[0,837,"Trads837"]
[0,838,"Trads838"]
[0,839,"Trads839"]
[0,840,"Trads840"]
[0,841,"Trads841"]
[0,842,"Trads842"]
[0,843,"Trads843"]
[0,844,"Trads844"]
[0,845,"Trads845"]
[0,846,"Trads846"]
[0,847,"Trads847"]
[0,848,"Trads848"]
[0,849,"Trads849"]
[0,850,"Trads850"]
[0,851,"Trads851"]
[0,852,"Trads852"]
[0,853,"Trads853"]
[0,854,"Trads854"]
[0,855,"Trads855"]
[0,856,"Trads856"]
[0,857,"Trads857"]
[0,858,"Trads858"]
[0,859,"Trads859"]
[0,860,"Trads860"]
[0,861,"Trads861"]
[0,862,"Trads862"]
[0,863,"Trads863"]
[0,864,"Trads864"]
[0,865,"Trads865"]
[0,866,"Trads866"]
[0,867,"Trads867"]
[0,868,"Trads868"]
[0,869,"Trads869"]
[0,870,"Trads870"]
[0,871,"Trads871"]
[0,872,"Trads872"]
[0,873,"Trads873"]
[0,874,"Trads874"]
[0,875,"Trads875"]
[0,876,"Trads876"]
[0,877,"Trads877"]
[0,878,"Trads878"]
[0,879,"Trads879"]
[0,880,"Trads880"]
[0,881,"Trads881"]
[0,882,"Trads882"]
[0,883,"Trads883"]
[0,884,"Trads884"]
[0,885,"Trads885"]
[0,886,"Trads886"]
[0,887,"Trads887"]
[0,888,"Trads888"]
[0,889,"Trads889"]
[0,890,"Trads890"]
[0,891,"Trads891"]
[0,892,"Trads892"]
[0,893,"Trads893"]
[0,894,"Trads894"]
[0,895,"Trads895"]
[0,896,"Trads896"]
[0,897,"Trads897"]
[0,898,"Trads898"]
[0,899,{"$f":"+_xlfn.CONCAT(\"Trads\",B899)","v":"Trads899"}]
[0,900,"Trads900"]
[0,901,"Trads901"]
[0,902,"Trads902"]
[0,903,"Trads903"]
[0,904,"Trads904"]
[0,905,"Trads905"]
[0,906,"Trads906"]
[0,907,"Trads907"]
[0,908,"Trads908"]
[0,909,"Trads909"]
[0,910,"Trads910"]
[0,911,"Trads911"]
[0,912,"Trads912"]
[0,913,"Trads913"]
[0,914,"Trads914"]
[0,915,"Trads915"]
[0,916,"Trads916"]
[0,917,"Trads917"]
[0,918,"Trads918"]
[0,919,"Trads919"]
[0,920,"Trads920"]
[0,921,"Trads921"]
[0,922,"Trads922"]
[0,923,"Trads923"]
[0,924,"Trads924"]
[0,925,"Trads925"]
[0,926,"Trads926"]
[0,927,"Trads927"]
[0,928,"Trads928"]
[0,929,"Trads929"]
[0,930,"Trads930"]
[0,931,"Trads931"]
[0,932,"Trads932"]
[0,933,"Trads933"]
[0,934,"Trads934"]
[0,935,"Trads935"]
[0,936,"Trads936"]
[0,937,"Trads937"]
[0,938,"Trads938"]
[0,939,"Trads939"]
[0,940,"Trads940"]
[0,941,"Trads941"]
[0,942,"Trads942"]
[0,943,"Trads943"]
[0,944,"Trads944"]
[0,945,"Trads945"]
[0,946,"Trads946"]
[0,947,"Trads947"]
[0,948,"Trads948"]
[0,949,"Trads949"]
[0,950,"Trads950"]
[0,951,"Trads951"]
[0,952,"Trads952"]
[0,953,"Trads953"]
[0,954,"Trads954"]
[0,955,"Trads955"]
[0,956,"Trads956"]
[0,957,"Trads957"]
[0,958,"Trads958"]
[0,959,"Trads959"]
[0,960,"Trads960"]
[0,961,"Trads961"]
[0,962,"Trads962"]
[0,963,{"$f":"+_xlfn.CONCAT(\"Trads\",B963)","v":"Trads963"}]
[0,964,"Trads964"]
[0,965,"Trads965"]
[0,966,"Trads966"]
[0,967,"Trads967"]
[0,968,"Trads968"]
[0,969,"Trads969"]
[0,970,"Trads970"]
[0,971,"Trads971"]
[0,972,"Trads972"]
[0,973,"Trads973"]
[0,974,"Trads974"]
[0,975,"Trads975"]
[0,976,"Trads976"]
[0,977,"Trads977"]
[0,978,"Trads978"]
[0,979,"Trads979"]
[0,980,"Trads980"]
[0,981,"Trads981"]
[0,982,"Trads982"]
[0,983,"Trads983"]
[0,984,"Trads984"]
[0,985,"Trads985"]
[0,986,"Trads986"]
[0,987,"Trads987"]
[0,988,"Trads988"]
[0,989,"Trads989"]
[0,990,"Trads990"]
[0,991,"Trads991"]
[0,992,"Trads992"]
[0,993,"Trads993"]
[0,994,"Trads994"]
[0,995,"Trads995"]
[0,996,"Trads996"]
[0,997,"Trads997"]
[0,998,"Trads998"]
[0,999,"Trads999"]
[0,1000,"Trads1000"]
[0,1001,"Trads1001"]
[0,1002,"Trads1002"]
[0,1003,"Trads1003"]
[0,1004,"Trads1004"]
[0,1005,"Trads1005"]
[0,1006,"Trads1006"]
[0,1007,"Trads1007"]
[0,1008,"Trads1008"]
[0,1009,"Trads1009"]
[0,1010,"Trads1010"]
[0,1011,"Trads1011"]
[0,1012,"Trads1012"]
[0,1013,"Trads1013"]
[0,1014,"Trads1014"]
[0,1015,"Trads1015"]
[0,1016,"Trads1016"]
[0,1017,"Trads1017"]
[0,1018,"Trads1018"]
[0,1019,"Trads1019"]
[0,1020,"Trads1020"]
[0,1021,"Trads1021"]
[0,1022,"Trads1022"]
[0,1023,"Trads1023"]
[0,1024,"Trads1024"]
[0,1025,"Trads1025"]
[0,1026,"Trads1026"]
[0,1027,{"$f":"+_xlfn.CONCAT(\"Trads\",B1027)","v":"Trads1027"}]
[0,1028,"Trads1028"]
[0,1029,"Trads1029"]
[0,1030,"Trads1030"]
[0,1031,"Trads1031"]
[0,1032,"Trads1032"]
[0,1033,"Trads1033"]
[0,1034,"Trads1034"]
[0,1035,"Trads1035"]
[0,1036,"Trads1036"]
[0,1037,"Trads1037"]
[0,1038,"Trads1038"]
[0,1039,"Trads1039"]
[0,1040,"Trads1040"]
[0,1041,"Trads1041"]
[0,1042,"Trads1042"]
[0,1043,"Trads1043"]
[0,1044,"Trads1044"]
[0,1045,"Trads1045"]
[0,1046,"Trads1046"]
[0,1047,"Trads1047"]
[0,1048,"Trads1048"]
[0,1049,"Trads1049"]
[0,1050,"Trads1050"]
[0,1051,"Trads1051"]
[0,1052,"Trads1052"]
[0,1053,"Trads1053"]
[0,1054,"Trads1054"]
[0,1055,"Trads1055"]
[0,1056,"Trads1056"]
[0,1057,"Trads1057"]
[0,1058,"Trads1058"]
[0,1059,"Trads1059"]
[0,1060,"Trads1060"]
[0,1061,"Trads1061"]
[0,1062,"Trads1062"]
[0,1063,"Trads1063"]
[0,1064,"Trads1064"]
[0,1065,"Trads1065"]
[0,1066,"Trads1066"]
[0,1067,"Trads1067"]
[0,1068,"Trads1068"]
[0,1069,"Trads1069"]
[0,1070,"Trads1070"]
[0,1071,"Trads1071"]
[0,1072,"Trads1072"]
[0,1073,"Trads1073"]
[0,1074,"Trads1074"]
[0,1075,"Trads1075"]
[0,1076,"Trads1076"]
[0,1077,"Trads1077"]
[0,1078,"Trads1078"]
[0,1079,"Trads1079"]
[0,1080,"Trads1080"]
[0,1081,"Trads1081"]
[0,1082,"Trads1082"]
[0,1083,"Trads1083"]
[0,1084,"Trads1084"]
[0,1085,"Trads1085"]
[0,1086,"Trads1086"]
[0,1087,"Trads1087"]
[0,1088,"Trads1088"]
[0,1089,"Trads1089"]
[0,1090,"Trads1090"]
[0,1091,{"$f":"+_xlfn.CONCAT(\"Trads\",B1091)","v":"Trads1091"}]
[0,1092,"Trads1092"]
[0,1093,"Trads1093"]
[0,1094,"Trads1094"]
[0,1095,"Trads1095"]
[0,1096,"Trads1096"]
[0,1097,"Trads1097"]
[0,1098,"Trads1098"]
[0,1099,"Trads1099"]
[0,1100,"Trads1100"]
[0,1101,"Trads1101"]
[0,1102,"Trads1102"]
[0,1103,"Trads1103"]
[0,1104,"Trads1104"]
[0,1105,"Trads1105"]
[0,1106,"Trads1106"]
[0,1107,"Trads1107"]
[0,1108,"Trads1108"]
[0,1109,"Trads1109"]
[0,1110,"Trads1110"]
[0,1111,"Trads1111"]
[0,1112,"Trads1112"]
[0,1113,"Trads1113"]
[0,1114,"Trads1114"]
[0,1115,"Trads1115"]
[0,1116,"Trads1116"]
[0,1117,"Trads1117"]
[0,1118,"Trads1118"]
[0,1119,"Trads1119"]
[0,1120,"Trads1120"]
[0,1121,"Trads1121"]
[0,1122,"Trads1122"]
[0,1123,"Trads1123"]
[0,1124,"Trads1124"]
[0,1125,"Trads1125"]
[0,1126,"Trads1126"]
[0,1127,"Trads1127"]
[0,1128,"Trads1128"]
[0,1129,"Trads1129"]
[0,1130,"Trads1130"]
[0,1131,"Trads1131"]
[0,1132,"Trads1132"]
[0,1133,"Trads1133"]
[0,1134,"Trads1134"]
[0,1135,"Trads1135"]
[0,1136,"Trads1136"]
[0,1137,"Trads1137"]
[0,1138,"Trads1138"]
[0,1139,"Trads1139"]
[0,1140,"Trads1140"]
[0,1141,"Trads1141"]
[0,1142,"Trads1142"]
[0,1143,"Trads1143"]
[0,1144,"Trads1144"]
[0,1145,"Trads1145"]
[0,1146,"Trads1146"]
[0,1147,"Trads1147"]
[0,1148,"Trads1148"]
[0,1149,"Trads1149"]
[0,1150,"Trads1150"]
[0,1151,"Trads1151"]
[0,1152,"Trads1152"]
[0,1153,"Trads1153"]
[0,1154,"Trads1154"]
[0,1155,{"$f":"+_xlfn.CONCAT(\"Trads\",B1155)","v":"Trads1155"}]
[0,1156,"Trads1156"]
[0,1157,"Trads1157"]
[0,1158,"Trads1158"]
[0,1159,"Trads1159"]
[0,1160,"Trads1160"]
[0,1161,"Trads1161"]
[0,1162,"Trads1162"]
[0,1163,"Trads1163"]
[0,1164,"Trads1164"]
[0,1165,"Trads1165"]
[0,1166,"Trads1166"]
[0,1167,"Trads1167"]
[0,1168,"Trads1168"]
[0,1169,"Trads1169"]
[0,1170,"Trads1170"]
[0,1171,"Trads1171"]
[0,1172,"Trads1172"]
[0,1173,"Trads1173"]
[0,1174,"Trads1174"]
[0,1175,"Trads1175"]
[0,1176,"Trads1176"]
[0,1177,"Trads1177"]
[0,1178,"Trads1178"]
[0,1179,"Trads1179"]
[0,1180,"Trads1180"]
[0,1181,"Trads1181"]
[0,1182,"Trads1182"]
[0,1183,"Trads1183"]
[0,1184,"Trads1184"]
[0,1185,"Trads1185"]
[0,1186,"Trads1186"]
[0,1187,"Trads1187"]
[0,1188,"Trads1188"]
[0,1189,"Trads1189"]
[0,1190,"Trads1190"]
[0,1191,"Trads1191"]
[0,1192,"Trads1192"]
[0,1193,"Trads1193"]
[0,1194,"Trads1194"]
[0,1195,"Trads1195"]
[0,1196,"Trads1196"]
[0,1197,"Trads1197"]
[0,1198,"Trads1198"]
[0,1199,"Trads1199"]
[0,1200,"Trads1200"]
[0,1201,"Trads1201"]
[0,1202,"Trads1202"]
[0,1203,"Trads1203"]
[0,1204,"Trads1204"]
[0,1205,"Trads1205"]
[0,1206,"Trads1206"]
[0,1207,"Trads1207"]
[0,1208,"Trads1208"]
[0,1209,"Trads1209"]
[0,1210,"Trads1210"]
[0,1211,"Trads1211"]
[0,1212,"Trads1212"]
[0,1213,"Trads1213"]
[0,1214,"Trads1214"]
[0,1215,"Trads1215"]
[0,1216,"Trads1216"]
[0,1217,"Trads1217"]
[0,1218,"Trads1218"]
[0,1219,{"$f":"+_xlfn.CONCAT(\"Trads\",B1219)","v":"Trads1219"}]
[0,1220,"Trads1220"]
[0,1221,"Trads1221"]
[0,1222,"Trads1222"]
[0,1223,"Trads1223"]
[0,1224,"Trads1224"]
[0,1225,"Trads1225"]
[0,1226,"Trads1226"]
[0,1227,"Trads1227"]
[0,1228,"Trads1228"]
[0,1229,"Trads1229"]
[0,1230,"Trads1230"]
[0,1231,"Trads1231"]
[0,1232,"Trads1232"]
[0,1233,"Trads1233"]
[0,1234,"Trads1234"]
[0,1235,"Trads1235"]
[0,1236,"Trads1236"]
[0,1237,"Trads1237"]
[0,1238,"Trads1238"]
[0,1239,"Trads1239"]
[0,1240,"Trads1240"]
[0,1241,"Trads1241"]
[0,1242,"Trads1242"]
[0,1243,"Trads1243"]
[0,1244,"Trads1244"]
[0,1245,"Trads1245"]
[0,1246,"Trads1246"]
[0,1247,"Trads1247"]
[0,1248,"Trads1248"]
[0,1249,"Trads1249"]
[0,1250,"Trads1250"]
[0,1251,"Trads1251"]
[0,1252,"Trads1252"]
[0,1253,"Trads1253"]
[0,1254,"Trads1254"]
[0,1255,"Trads1255"]
[0,1256,"Trads1256"]
[0,1257,"Trads1257"]
[0,1258,"Trads1258"]
[0,1259,"Trads1259"]
[0,1260,"Trads1260"]
[0,1261,"Trads1261"]
[0,1262,"Trads1262"]
[0,1263,"Trads1263"]
[0,1264,"Trads1264"]
[0,1265,"Trads1265"]
[0,1266,"Trads1266"]
[0,1267,"Trads1267"]
[0,1268,"Trads1268"]
[0,1269,"Trads1269"]
[0,1270,"Trads1270"]
[0,1271,"Trads1271"]
[0,1272,"Trads1272"]
[0,1273,"Trads1273"]
[0,1274,"Trads1274"]
[0,1275,"Trads1275"]
[0,1276,"Trads1276"]
[0,1277,"Trads1277"]
[0,1278,"Trads1278"]
[0,1279,"Trads1279"]
[0,1280,"Trads1280"]
[0,1281,"Trads1281"]
[0,1282,"Trads1282"]
[0,1283,{"$f":"+_xlfn.CONCAT(\"Trads\",B1283)","v":"Trads1283"}]
[0,1284,"Trads1284"]
[0,1285,"Trads1285"]
[0,1286,"Trads1286"]
[0,1287,"Trads1287"]
[0,1288,"Trads1288"]
[0,1289,"Trads1289"]
[0,1290,"Trads1290"]
[0,1291,"Trads1291"]
[0,1292,"Trads1292"]
[0,1293,"Trads1293"]
[0,1294,"Trads1294"]
[0,1295,"Trads1295"]
[0,1296,"Trads1296"]
[0,1297,"Trads1297"]
[0,1298,"Trads1298"]
[0,1299,"Trads1299"]
[0,1300,"Trads1300"]
[0,1301,"Trads1301"]
[0,1302,"Trads1302"]
[0,1303,"Trads1303"]
[0,1304,"Trads1304"]
[0,1305,"Trads1305"]
[0,1306,"Trads1306"]
[0,1307,"Trads1307"]
[0,1308,"Trads1308"]
[0,1309,"Trads1309"]
[0,1310,"Trads1310"]
[0,1311,"Trads1311"]
[0,1312,"Trads1312"]
[0,1313,"Trads1313"]
[0,1314,"Trads1314"]
[0,1315,"Trads1315"]
[0,1316,"Trads1316"]
[0,1317,"Trads1317"]
[0,1318,"Trads1318"]
[0,1319,"Trads1319"]
[0,1320,"Trads1320"]
[0,1321,"Trads1321"]
[0,1322,"Trads1322"]
[0,1323,"Trads1323"]
[0,1324,"Trads1324"]
[0,1325,"Trads1325"]
[0,1326,"Trads1326"]
[0,1327,"Trads1327"]
[0,1328,"Trads1328"]
[0,1329,"Trads1329"]
[0,1330,"Trads1330"]
[0,1331,"Trads1331"]
[0,1332,"Trads1332"]
[0,1333,"Trads1333"]
[0,1334,"Trads1334"]
[0,1335,"Trads1335"]
[0,1336,"Trads1336"]
[0,1337,"Trads1337"]
[0,1338,"Trads1338"]
[0,1339,"Trads1339"]
[0,1340,"Trads1340"]
[0,1341,"Trads1341"]
[0,1342,"Trads1342"]
[0,1343,"Trads1343"]
[0,1344,"Trads1344"]
[0,1345,"Trads1345"]
[0,1346,"Trads1346"]
[0,1347,{"$f":"+_xlfn.CONCAT(\"Trads\",B1347)","v":"Trads1347"}]
[0,1348,"Trads1348"]
[0,1349,"Trads1349"]
[0,1350,"Trads1350"]
[0,1351,"Trads1351"]
[0,1352,"Trads1352"]
[0,1353,"Trads1353"]
[0,1354,"Trads1354"]
[0,1355,"Trads1355"]
[0,1356,"Trads1356"]
[0,1357,"Trads1357"]
[0,1358,"Trads1358"]
[0,1359,"Trads1359"]
[0,1360,"Trads1360"]
[0,1361,"Trads1361"]
[0,1362,"Trads1362"]
[0,1363,"Trads1363"]
[0,1364,"Trads1364"]
[0,1365,"Trads1365"]
[0,1366,"Trads1366"]
[0,1367,"Trads1367"]
[0,1368,"Trads1368"]
[0,1369,"Trads1369"]
[0,1370,"Trads1370"]
[0,1371,"Trads1371"]
[0,1372,"Trads1372"]
[0,1373,"Trads1373"]
[0,1374,"Trads1374"]
[0,1375,"Trads1375"]
[0,1376,"Trads1376"]
[0,1377,"Trads1377"]
[0,1378,"Trads1378"]
[0,1379,"Trads1379"]
[0,1380,"Trads1380"]
[0,1381,"Trads1381"]
[0,1382,"Trads1382"]
[0,1383,"Trads1383"]
[0,1384,"Trads1384"]
[0,1385,"Trads1385"]
[0,1386,"Trads1386"]
[0,1387,"Trads1387"]
[0,1388,"Trads1388"]
[0,1389,"Trads1389"]
[0,1390,"Trads1390"]
[0,1391,"Trads1391"]
[0,1392,"Trads1392"]
[0,1393,"Trads1393"]
[0,1394,"Trads1394"]
[0,1395,"Trads1395"]
[0,1396,"Trads1396"]
[0,1397,"Trads1397"]
[0,1398,"Trads1398"]
[0,1399,"Trads1399"]
[0,1400,"Trads1400"]
[0,1401,"Trads1401"]
[0,1402,"Trads1402"]
[0,1403,"Trads1403"]
[0,1404,"Trads1404"]
[0,1405,"Trads1405"]
[0,1406,"Trads1406"]
[0,1407,"Trads1407"]
[0,1408,"Trads1408"]
[0,1409,"Trads1409"]
[0,1410,"Trads1410"]
[0,1411,{"$f":"+_xlfn.CONCAT(\"Trads\",B1411)","v":"Trads1411"}]
[0,1412,"Trads1412"]
[0,1413,"Trads1413"]
[0,1414,"Trads1414"]
[0,1415,"Trads1415"]
[0,1416,"Trads1416"]
[0,1417,"Trads1417"]
[0,1418,"Trads1418"]
[0,1419,"Trads1419"]
[0,1420,"Trads1420"]
[0,1421,"Trads1421"]
[0,1422,"Trads1422"]
[0,1423,"Trads1423"]
[0,1424,"Trads1424"]
[0,1425,"Trads1425"]
[0,1426,"Trads1426"]
[0,1427,"Trads1427"]
[0,1428,"Trads1428"]
[0,1429,"Trads1429"]
[0,1430,"Trads1430"]
[0,1431,"Trads1431"]
[0,1432,"Trads1432"]
[0,1433,"Trads1433"]
[0,1434,"Trads1434"]
[0,1435,"Trads1435"]
[0,1436,"Trads1436"]
[0,1437,"Trads1437"]
[0,1438,"Trads1438"]
[0,1439,"Trads1439"]
[0,1440,"Trads1440"]
[0,1441,"Trads1441"]
[0,1442,"Trads1442"]
[0,1443,"Trads1443"]
[0,1444,"Trads1444"]
[0,1445,"Trads1445"]
[0,1446,"Trads1446"]
[0,1447,"Trads1447"]
[0,1448,"Trads1448"]
[0,1449,"Trads1449"]
[0,1450,"Trads1450"]
[0,1451,"Trads1451"]
[0,1452,"Trads1452"]
[0,1453,"Trads1453"]
[0,1454,"Trads1454"]
[0,1455,"Trads1455"]
[0,1456,"Trads1456"]
[0,1457,"Trads1457"]
[0,1458,"Trads1458"]
[0,1459,"Trads1459"]
[0,1460,"Trads1460"]
[0,1461,"Trads1461"]
[0,1462,"Trads1462"]
[0,1463,"Trads1463"]
[0,1464,"Trads1464"]
[0,1465,"Trads1465"]
[0,1466,"Trads1466"]
[0,1467,"Trads1467"]
[0,1468,"Trads1468"]
[0,1469,"Trads1469"]
[0,1470,"Trads1470"]
[0,1471,"Trads1471"]
[0,1472,"Trads1472"]
[0,1473,"Trads1473"]
[0,1474,"Trads1474"]
[0,1475,{"$f":"+_xlfn.CONCAT(\"Trads\",B1475)","v":"Trads1475"}]
[0,1476,"Trads1476"]
[0,1477,"Trads1477"]
[0,1478,"Trads1478"]
[0,1479,"Trads1479"]
[0,1480,"Trads1480"]
[0,1481,"Trads1481"]
[0,1482,"Trads1482"]
[0,1483,"Trads1483"]
[0,1484,"Trads1484"]
[0,1485,"Trads1485"]
[0,1486,"Trads1486"]
[0,1487,"Trads1487"]
[0,1488,"Trads1488"]
[0,1489,"Trads1489"]
[0,1490,"Trads1490"]
[0,1491,"Trads1491"]
[0,1492,"Trads1492"]
[0,1493,"Trads1493"]
[0,1494,"Trads1494"]
[0,1495,"Trads1495"]
[0,1496,"Trads1496"]
[0,1497,"Trads1497"]
[0,1498,"Trads1498"]
[0,1499,"Trads1499"]
[0,1500,"Trads1500"]
[null,null,"Trads"]

{"sheet":"TradsDB","index":6,"n_rows":800,"n_cols":22,"rows_kept":800,"hidden":true}
["#",null,"Italiano","čeština","汉语","Hrvatski","Français","大和","Γκρέγκο","English","Latvietis","Polski","Português","Română","Русский","Slovenčina","Slovenščina","Español","Svenska","Deutsch","Türkçe","Magyar Nyelv"]
[2,{"$f":"+_xlfn.CONCAT(\"Trad\",A2)","v":"Trad2"},"SUPPORTO","PODPORA","支持","PODRŠKA","SOUTIEN","サポート","ΥΠΟΣΤΗΡΙΞΗ","SUPPORT","ATBALSTS","POMOC","APOIO","SUPORT","ПОДДЕРЖКА","PODPORA","PODPORA","SOPORTE","STÖD","GRUNDPLATTE","DESTEK","TÁMOGATÁS"]
[3,"Trad3","Listino Prezzi","Ceník","价格表","Cjenik","Liste des prix","価格表","Λίστα τιμών","Price List","Cenrādis","Cennik","Lista de preços","Lista de prețuri","Прайс-лист","Cenník","Cenik","Lista de precios","Prislista","Preislisten","Fiyat listesi","Árlista"]
[4,"Trad4","Lingua","Jazyk","语言","Jezik","Langue","言語","Γλώσσα","Language","Valoda","Język","Idioma","Limba","Язык","Jazyk","Jezik","Idioma","Språk","Sprache","Dilim","Nyelv"]
[5,"Trad5","Valuta","Měna","货币","Valuta","Devise","通貨","Νόμισμα","Currency","Valūta","Waluta","Moeda","Monedă","Валюта","Mena","Valuta","Moneda","Valuta","Währung","Para birimi","Pénznem"]
[6,"Trad6","Rif. Progetto","Projekt Ref.","项目编号。","Projekt Ref.","Réf. du projet","参照プロジェクト","Υπεύθυνος Έργου","Project Ref.","Projekta atsauces Nr.","Nr ref. projektu","Projecto Ref.","Proiect Ref.","Ссылка на проект.","Ref. projektu","Ref. projekta","Ref. del proyecto","Projekt Ref.","Projekt Ref.","Proje Referansı","Projekt Ref."]
[7,"Trad7","SOTTOSTRUTTURA","SUBSTRUKTURA","结构","PODSTRUKTURA","SUBSTRUCTURE","サブストラクチャー","ΥΠΟΔΟΜΗ","SUBSTRUCTURE","SUBSTRUKTŪRA","PODBUDOWA","SUBSTRUTURA","SUBSTRUCTURA","СУБСТРУКТУРА","SUBSTRUKTÚRA","SUBSTRUKCIJA","SUBESTRUCTURA","SUBSTRUKTUR","Unterkonstruktion","ALT YAPI","ALSZERKEZET"]
[8,"Trad8","SUPPORTO PRINCIPALE","HLAVNÍ PODPORA","主要支持","GLAVNA PODRŠKA","SUPPORT PRINCIPAL","メインサポート","ΚΥΡΙΑ ΥΠΟΣΤΗΡΙΞΗ","MAIN SUPPORT","GALVENIS ATBALSTS","WSPARCIE GŁÓWNE","APOIO PRINCIPAL","SUPORT PRINCIPAL","ГЛАВНАЯ ОПОРА","HLAVNÁ PODPORA","GLAVNA PODPORA","SOPORTE PRINCIPAL","HUVUDSTÖD","Grundplatte","ANA DESTEK","FŐ TÁMOGATÁS"]
[9,"Trad9","COMPONENTI","KOMPONENTY","构成部分","KOMPONENTE OD","COMPOSANTS DE","コンポーネント","ΣΥΣΤΑΤΙΚΑ ΤΗΣ","COMPONENTS OF","KOMPONENTI","CZĘŚCI","COMPONENTES DE","COMPONENTE DE","КОМПОНЕНТЫ","KOMPONENTY","SESTAVNI DELI","COMPONENTES","KOMPONENTER AV","Komponenten","IN BİLEŞENLERİ","ÖSSZETEVŐK"]
[10,"Trad10","TIPO INTERMEDIO","STŘEDOVÝ TYP","中间件类型","SREDNJI TIP","TYPE INTERMÉDIAIRE","中間タイプ","ΕΝΔΙΑΜΕΣΟΣ ΤΥΠΟΣ","INTERMEDIATE TYPE","STARPPOSMA TIPS","TYP POŚREDNI","TIPO INTERMÉDIO","TIP INTERMEDIAR","ПРОМЕЖУТОЧНЫЙ ТИП","PRECHODNÝ TYP","VMESNI TIP","TIPO INTERMEDIO","MELLAN TYP","Art des Zwischenstück","ARA TİP","KÖZTES TÍPUS"]
[11,"Trad11","INTERMEDIO","STŘEDOVÝ","中间的","SREDNJI","INTERMEDIAIRE","中間","ΕΝΔΙΑΜΕΣΟΣ","INTERMEDIATE","STARPPOSMS","MEDIATOR","INTERMÉDIO","INTERMEDIARĂ","ПРОМЕЖУТОЧНЫЙ","MEDZINÁRODNÝ","VMESNI","INTERMEDIO","MELLANLIGGANDE","Zwischenstück","ORTA DÜZEY","KÖZTES"]
[12,"Trad12","Codice","Kód","编码","Kod","Code","コード","Κώδικας","Code","Kods","Kod","Código","Cod","Код","Kód","Koda","Código","Koda","Kodex","kod","Kód"]
[13,"Trad13","TIPO ANGOLO","TYP ROHU","转角件类型","TIP UGLA","TYPE D'ANGLE","コーナータイプ","ΤΥΠΟΣ ΓΩΝΙΑΣ","CORNER TYPE","STŪRA TIPS","RODZAJ NAROŻNIKA","TIPO ÂNGULO","TIP COLȚAR","ТИП УГЛОВОЙ","ROHOVÝ TYP","VRTNI TIP","Tipo de ángulo","HÖRNTYP","Art des Winkels","KÖŞE TİPİ","SARKOS TÍPUS"]
[14,"Trad14","TIPO NAVETTA","TYP JEZDCE","滑梭类型","TIP TRANSPORTERA","TYPE DE BATEAU","シャトルタイプ","ΤΥΠΟΣ ΜΕΤΑΦΟΡΑΣ","SHUTTLE TYPE"," SLĪDŅA VEIDS","TYP WAHADŁOWY","TIPO DE SHUTTLE","TIPUL DE CUTREMUR","ТИП МАРШРУТКИ","TYP KRÁTKODOBÝ","VRSTA ZAVAROVANJA","TIPO DE carril","SHUTTLE TYPE","Art des Gleiters","mekik tipi","KOCSI TÍPUS"]
[15,"Trad15","NUMERO DI NAVETTE","POČET JEZDCŮ","滑梭的数量","NO. TRANSPORTERA","NB. DE BATEAUX","シャトルの番号","ΑΡ. ΜΕΤΑΦΟΡΩΝ","NO. OF SHUTTLES","SLĪDŅU SKAITS","NIE. WAŁÓWEK","NUM. DE SHUTTLE","NU. DE ȘOARETE","НЕТ. МАРШРУТОК","Č. ČÍSLA","NE. ŠKATLJEV","NÚMERO DE CARRILES","NEJ. AV FÖRBINDNINGAR","Nr/Anzahl des Gleiters","NUMARA. MERKEZLER","KOCSIK SZÁMA"]
[16,"Trad16","N. DI NAVETTE PER LINEA VITA","POČET JEZDCŮ NA LANKOVÝ SYSTÉM","生命线滑梭数量","NO. TRANSPORTERA ZA LINIJU ŽIVOTA","NO. DE NAVETTES POUR LES LIGNES DE VIE","ライフライン用シャトルの番号","ΑΡ. ΜΕΤΑΦΟΡΩΝ ΓΙΑ ΓΡΑΜΜΕΣ ΖΩΗΣ","NO. OF SHUTTLES FOR LIFE LINES","SLĪDŅU SKAITS DROŠĪBAS LĪNIJAI","NIE. WACHTÓW NA LINIE ŻYCIA","NUM. DE SHUTTLES PARA LINHAS DE VIDA","NR. DE NAVETE PENTRU LINII DE VIAȚĂ","NO. ЧЕЛНОКОВ ДЛЯ СПАСАТЕЛЬНЫХ ЛИНИЙ","Č. RAKETOPLÁNOV PRE LINKY ZÁCHRANY","NO. ČOLNOV ZA REŠILNE PROGE","NUM.CARRILES PARA LÍNEAS","NEJ. AV SKYDD FÖR LIVSLINJER","Nr/Anzahl der Gleiter für Lebenslinien","NUMARA. YAŞAM HATLARI İÇİN MERKEZLER","KÁBELES RENDSZEREKHEZ SZÜKSÉGES KOCSIK SZÁMA"]
[17,"Trad17","PASSANTE","PRŮBĚŽNÝ","可通过","PROLAZNA","PASSANT À TRAVERS","通過できる","ΔΙΕΡΧΕΤΑΙ","PASSING THROUGH","ŠKĒRSOJAMAS","PRZEJAZDEM","PASSANTE","CARE TREC PRIN","ПРОХОДЯЩИЙ","PRECHÁDZAJÚCE","KI POTEKAJO SKOZI","Pasante","PASSERAR GENOM","DURCHLAUFEND","İÇİNDEN GEÇMEK","ÁTJÁRHATÓ"]
[18,"Trad18","NON PASSANTE","NEPRŮBĚŽNÝ","不可通过","NIJE  PROLAZNA","NE PASSANT PAS À TRAVERS","通過できない","ΔΕΝ ΔΙΕΡΧΕΤΑΙ","NOT PASSING TROUGH","NEŠĶĒRSOJAMAS","NIE PRZECHODZĄ","NÃO PASSANTE","CARE NU TREC PRIN PASAJ","НЕ ПРОХОДЯЩИЙ ЖЕЛОБ","NEPRECHÁDZAJÚCE KORYTOM","KI NE POTEKAJO SKOZI KORITO","No pasante","GÅR INTE GENOM","NICHT DURCHLAUFEND","GEÇMİYOR","NEM ÁTJÁRHAT"]
[19,"Trad19","LEGNO","DŘEVO","木材","DRVO","TIMBRE","木材","ΞΥΛΕΙΑ","TIMBER","KOKS","DREWNO","MADEIRA","TIMBRUL","БРУСЧАТКА","DREVO","TIMBER","MADERA","TIMMER","HOLZ","KERESTE","FA"]
[20,"Trad20","CEMENTO","BETON","混凝土","BETON","BÉTON","コンクリート","ΣΚΥΡΟΔΕΜΑ","CONCRETE","BETONS","BETON","BETÃO","BETON","КОНКРЕТ","BETÓN","BETON","HORMIGÓN","BETONG","BETON","BETON","BETON"]
[21,"Trad21","ACCIAIO","OCEL","钢材","ŽELJEZO","ACIER","スティール","ΑΤΣΑΛΙ","STEEL","TĒRAUDS","STAL","AÇO","OȚEL","СТАЛЬ","OCEL","JEKLO","ACERO","STÅL","STAHL","ÇELİK","ACÉL"]
[22,"Trad22","Descrizione","Popis","描述","Opis","Description","概要","Περιγραφή","Description","Apraksts","Opis","Descrição","Descriere","Описание","Popis","Opis","Descripción","Beskrivning","Beschreibung","Açıklama","Leírás"]
[23,"Trad23","n.","č.","编号","Ne.","Non.","番号","Αρ.","No.","Nr.","Nr.","Num.","Nr.","Нет.","Č.","Št.","Num. ","Nej.","Nr.","Numara.","Sorszám"]
[24,"Trad24","Prezzo Lordo","Doporučená cena","价格","Lord Price","Prix Lordo","税込み総額","Ακαθάριστη τιμή","Lord Price","Cena","Lord Price","PREÇO BRUTO","Prețul Domnului","Лордо Цена","Lord Cena","Lord Cena","precio bruto  ","Lord Price","Bruttopreis","Lord Fiyat","Ár"]
[25,"Trad25","Subtotale Lordo","Mezisoučet (dop. ceny)","主小计","Lord Međuzbir","Sous-total Lord","税込み小計","Μικτό υποσύνολο","Lord Subtotal","Starpsumma","Suma pośrednia Brutto","SUBTOTAL BRUTO","Lord Subtotal","Лордо Итого","Lord Medzisúčet","Lord vmesni seštevek","Subtotal bruto","Lord Subtotal","Gesamtpreis","Lord Ara Toplamı","Részösszeg"]
[26,"Trad26","Sconto","Sleva","折扣","Popust","REMISE","割引","Εκπτωση","Discount","Atlaide","Zniżka","Desconto","Reducere","Скидка","Zľava","Popust","Descuento","Rabatt","Rabatt","İndirim","Kedvezmény"]
[27,"Trad27","ACCESSORI","PŘÍSLUŠENSTVÍ","配件","PRIBOR","ACCESSOIRES","付属品","ΑΞΕΣΟΥΑΡ","ACCESSORIES","PIEDERUMI","AKCESORIA","ACESSÓRIOS","ACCESORII","АКСЕССУАРЫ","PRÍSLUŠENSTVO","DODATKI","ACCESORIOS","TILLBEHÖR","ZUBEHÖR","AKSESUARLAR","KIEGÉSZÍTŐK"]
[28,"Trad28","TIPO DI SCALA","TYP ŽEBŘÍKU","梯子类型","TIP LJESTAVA","TYPE D'ÉCHELLE","梯子のタイプ","ΤΥΠΟΣ ΣΚΑΛΑΣ","LADDER TYPE","KĀPŅU TIPS","TYP DRABINY","TIPO DE ESCADA","TIPUL DE SCĂRIȚĂ","ТИП МАСШТАБА","TYP LADDER","VRSTA LEŽIŠČA","Tipo de escalera","LADDER TYPE","LEITERTYP","MERDİVEN TİPİ","LÉTRA TÍPUS"]
[29,"Trad29","Normativa","Standardní","规范性","Normativ","NORMATIF","基準","Κανονισμός","Normative","Normatīvs","Normatywne","Norma","Normativ","НОРМАТИВ","Normatívne","Normativni","Normativa  ","Normativ","NORMATIV","normatif","Normatív"]
[30,"Trad30","CON GABBIA","S KOŠEM","带笼","S KAVEZOM","A CRINOLINE","ケージ付き","ΜΕ ΚΛΩΒΟ","WITH CAGE","AR drošības karkasu ","Z KLATKĄ","COM GAIOLA","CU CU CUȘCĂ","С КЛЕТКОЙ","S KLIETKOU","S KLETKO","CON JAULA","MED BUR","MIT KÄFIG","KAFESLİ","KERETTEL"]
[31,"Trad31","SENZA GABBIA","BEZ KOŠE","无笼","BEZ KAVEZA","SANS CRINOLINE","ケージなし","ΧΩΡΙΣ ΚΛΩΒΟ","WITHOUT CAGE","BEZ drošības KARKASA","BEZ KLATKI","SEM GAIOLA","FĂRĂ CUȘCĂ","БЕЗ КЛЕТКИ","BEZ KLIETKY","BREZ KLETKE","SIN JAULA","UTAN BUR","OHNE KÄFIG","KAFESSİZ","KERET NÉLKÜL"]
[32,"Trad32","NO","NE","否","NE","NON","いいえ","ΟΧΙ","NO","BEZ","NIE","NÃO","NU","НЕТ","BEZ","NE","NO","NEJ","NEIN","NUMARA","NEM"]
[33,"Trad33","SI","ANO","是","DA","OUI","はい","ΝΑΙ","YES","JĀ","TAK","SIM","DA","ДА","ÁNO","DA","SI","JA","JA","EVET","IGEN"]
[34,"Trad34","Prezzo Netto","Nákupní cena","净价","NETO cijena","PRIX NET","税抜き合計","Καθαρή τιμή","Net Price","Neto cena","Cena netto","Preço líquido","Preț net","ЧИСТАЯ ЦЕНА","Čistá cena","Neto cena","Precio Neto","Nettopris","NETTO-PREIS","Net fiyat","Nettó ár"]
[35,"Trad35","ALTEZZA ALLO SBARCO","POTŘEBNÁ VÝŠKA","到达的高度","VISINA ZA DOSEGNUTI","HAUTEUR À L'ATTERRISSAGE","到達できる高さ","ΜΕΓΙΣΤΟ ΥΨΟΣ","HEIGHT TO REACH","AUGSTUMS LĪDZ SASNIEDZAMAJAM PUNKTAM","WYSOKOŚĆ DO OSIĄGNIĘCIA","ALTURA A ATINGIR","ÎNĂLȚIME PENTRU A AJUNGE","ВЫСОТА ПРИ ПОСАДКЕ","VÝŠKA NA DOSAH","VIŠINA ZA DOSEGO","ALTURA DE PLATAFORMA","HÖJD ATT NÅ","HÖHE BEI DER LANDUNG","ULAŞILACAK YÜKSEKLİK","ELÉRENDŐ MAGASSÁG"]
[36,"Trad36","PROFONDITA' STAFFE","VELKOST DRŽÁKU","支架尺寸","VELIČINA NOSAČA","PROFONDEUR DES STIRRUPS","ブラケット寸法","ΜΕΓΕΘΟΣ ΛΑΒΗΣ","BRACKET SIZE","STIPRINĀJUMA IZMĒRS","ROZMIAR WSPORNIKA","TAMANHO DE BRACKET","DIMENSIUNEA SUPORTULUI","ГЛУБИНА СТИРРУПОВ","VEĽKOSŤ DRŽIAKA","VELIKOST NOSILCA","PROFUNDIDAD DE SOPORTE","FÄLGSTORLEK","Befestigungs Tiefe","BRAKET BOYUTU","RÖGZÍTŐ MÉRETE"]
[37,"Trad37","PROTEZIONE FINALE ","KONEČNÁ OCHRANA ","最终保护","ZAVRŠNA ZAŠTITA","PROTECTION DÉFINITIVE ","最終プロテクション","ΤΕΛΙΚΗ ΠΡΟΣΤΑΣΙΑ","FINAL PROTECTION","GALA AIZSARDZĪBA","OCHRONA KOŃCOWA","PROTECÇÃO FINAL","PROTECȚIE FINALĂ","ОКОНЧАТЕЛЬНАЯ ЗАЩИТА ","KONEČNÁ OCHRANA","KONČNA ZAŠČITA","PROTECCIÓN FINAL ","SLUTSKYDD","entgültige Sicherung","SON KORUMA","VÉGSŐ VÉDELEM"]
[38,"Trad38","ESTENSIONE RIMOVIBILE","ODNÍMATELNÉ ROZŠÍŘENÍ","可移动的延伸部分","NADOGRADNJA KOJA SE MOŽE UKLONITI","EXTENSION AMOVIBLE","取外し可能なエクステンション","ΑΦΑΙΡΟΥΜΕΝΗ ΕΠΕΚΤΑΣΗ","REMOVABLE EXTENSION","NOŅEMAMS PAGARINĀJUMS","ZDEJMOWANE PRZEDŁUŻENIE","EXTENSÃO AMOVÍVEL","EXTENSIE DETAȘABILĂ","СЪЕМНЫЙ УДЛИНИТЕЛЬ","ODNÍMATEĽNÝ NADSTAVEC","ODSTRANLJIV PODALJŠEK","EXTENSIÓN REMOVIBLE","AVLÄGGBAR UTVIDGNING","ABNEHMBARE VERLÄNGERUNG","ÇIKARILABİLİR UZATMA","LEVEHETŐ HOSSZABBÍTÓ"]
[39,"Trad39","PEDANA DI SBARCO","VSTUPNÍ PLOŠINA","着陆平台","PLATFORMA ZA ISKRCAVANJE","PLATE-FORME DE DÉBARQUEMENT","ランディングプラットフォーム","ΠΛΑΤΦΟΡΜΑ ΠΡΟΣΓΕΙΩΣΗΣ","LANDING PLATFORM","PIEZEMĒŠANĀS PLATFORMA","PLATFORMA DO LĄDOWANIA","PLATAFORMA DE ATERRAGEM","PLATFORMĂ DE ATERIZARE","ПЛАТФОРМА ДЛЯ ВЫСАДКИ","PRISTÁVACIA PLOŠINA","PLOŠČAD ZA PRISTAJANJE","PLATAFORMA DE DESENBARCO","LANDANDE PLATTFORM","AUSSCHIFFUNGSPLATTFORM","İNİŞ PLATFORMU","FOGADÓ ÁLLOMÁS"]
[40,"Trad40","SBARCO 500x500","PLOŠINA 500x500","500x500着陆平台","500x500 PODEST","DÉCHARGEMENT 500x500","ランディング 500x500","500Χ500 ΠΡΟΣΓΕΙΩΣΗ","500x500 LANDING","500x500  PLATFORMA","500x500 LĄDOWANIE","500x500 ATERRAGEM","500x500 ATERIZARE","разгрузка 500х500","500x500 PRÍSTAVNÁ PLOŠINA","500x500 Pristanišče","PLATAFORMA 500x500","500x500 LANDNING","ENTLADEN 500x500","500x500 İNİŞ","500x500 FOGADÓ"]
[41,"Trad41","SBARCO 500x750","PLOŠINA 500x750","500x750着陆平台","500x750 PODEST","DÉCHARGEMENT 500x750","ランディング 500x750","500x750 ΠΡΟΣΓΕΙΩΣΗ","500x750 LANDING","500x750 Platforma ","LĄDOWANIE 500x750","500x750 ATERRAGEM","500x750 Aterizare","разгрузка 500x750","500x750 PRÍSTAVNÁ PLOŠINA","500x750 Pristanišče","PLATAFORMA 500x750","500x750 LANDNING","ENTLADEN 500x750","500x750 İNİŞ","500x750 FOGADÓ"]
[42,"Trad42","PROTEZIONE SBARCO","PLOŠINOVÝ RÁM","着陆保护","ZAŠTITA PODESTA","PROTECTION À L'ATTERRISSAGE","ランディングプロテクション","ΠΡΟΣΤΑΣΙΑ ΠΡΟΣΓΕΙΩΣΗΣ","LANDING PROTECTION","Platformas AIZSARDZĪBA","OCHRONA LĄDOWANIA","PROTECÇÃO DE ATERRAGEM","PROTECȚIE LA ATERIZARE","ЗАЩИТА ПРИ ПОСАДКЕ","OCHRANA PRI PRISTÁTÍ","ZAŠČITA ZA PRISTAJANJE","PROTECCIÓN DE PLATAFORMA","LANDSKYDD","LANDESCHUTZ","İNİŞ KORUMASI","LESZÁLLÁS ELLENI VÉDELEM"]
[43,"Trad43","PEDANA DI RIPOSO","ODPOČINKOVÁ PLOŠINA","休息平台","OSTALE PLATFORME","PLATE-FORME DE REPOS","休息プラットフォーム","ΠΛΑΤΦΟΡΜΑ ΞΕΚΟΥΡΑΣΗΣ","REST PLATFORM","Atpūtas PLATFORMA","PLATFORMA WYPOCZYNKOWA","PLATAFORMA DE REPOSO","PLATFORMĂ DE ODIHNĂ","ПЛАТФОРМА ДЛЯ ОТДЫХА","PLATFORMA NA ODSTAVENIE","PLATFORMA ZA POLETJE","PLATAFORMA DE DESCANSO","VILLA PLATTFORM","Ruheplattform","DİNLENME PLATFORMU","PIHENŐPLATFORM"]
[44,"Trad44","PEDANA RIBALTABILE","SKLÁPĚCÍ PLOŠINA","可折叠平台","SKLOPIVA PLATFORMA","PLATE-FORME DE BASCULEMENT","折りたたみ可プラットフォーム","ΠΤΥΣΣΟΜΕΝΗ ΠΛΑΤΦΟΡΜΑ","FOLDABLE PLATFORM","SALOKĀMA PLATFORMA","SKŁADANA PLATFORMA","PLATAFORMA DOBRÁVEL","PLATFORMĂ PLIABILĂ","ОПРОКИДЫВАЮЩАЯСЯ ПЛАТФОРМА","SKLADACIA PLOŠINA","ZLOŽLJIVA PLOŠČAD","PLATAFORMA BASCULANTE","Fällbar plattform","kippbare Plattform","KATLANABİLİR PLATFORM","ÖSSZECSUKHATÓ PLATFORM"]
[45,"Trad45","RIBALTABILE PER LV VERTICALE","SKLÁPĚCÍ PLOŠINA PRO VERTIKÁLNÍ LS","可折叠的VII平台","MOGUĆE ZA VLL","PLATE-FORME BASCULANTE POUR LV VERTICAL","垂直ライフライン用折りたたみ","ΠΤΥΣΣΟΜΕΝΗ ΓΙΑ VLL","FOLDABLE FOR VLL","SALOKĀMA priekš VLL","SKŁADANY DO VLL","DOBRÁVEL PARA VLL","PLIABILĂ PENTRU VLL","ОПРОКИДЫВАЮЩАЯСЯ ПЛАТФОРМА ДЛЯ ВЕРТИКАЛЬНЫХ ЛЬВОВ","SKLADACIA PRE VLL","ZLOŽLJIVA ZA VLL","PLATAFORMA BASCULANTE PARA LV VERTICAL","FALLBAR FÖR VLL","kippbare Plattform für vertikale Lebenslinien","VLL İÇİN KATLANABİLİR","ÖSSZECSUKHATÓ A VLL-HEZ"]
[46,"Trad46","NORMATIVA PEDANA","NORMATÍVNA PLOŠINA","平台规范性","PLATFORMA NORMATIVNA","RÉGLEMENTATION DES PLATES-FORMES","プラットフォームの基準","ΚΑΝΟΝΙΚΗ ΠΛΑΤΦΟΡΜΑ","PLATFORM NORMATIVE","PLATFORMAs normatīvs","PLATFORMA NORMATYWNA","NORMA DA PLATAFORMA","PLATFORMĂ NORMATIVĂ","ПРАВИЛА ПЛАТФОРМЫ","PLOŠINA NORMATÍVNA","PLOŠČAD NORMATIVNA","NORMAS DE LA PLATAFORMA","PLATTFORM NORMATIV","PLATTFORMVORSCHRIFTEN","PLATFORM NORMATİFİ","PLATFORM NORMATÍV"]
[47,"Trad47","BOTOLA DI CHIUSURA","ZABEZPEČOVACÍ KRYT","安全关闭","SIGURNOSNO ZATVARANJE","HATCH DE FERMETURE","不法侵入防止ふた","ΚΛΕΙΣΙΜΟ ΑΣΦΑΛΕΙΑΣ","SECURITY CLOSURE","DROŠĪBAS AIZVĒRŠANA","ZAMKNIĘCIE BEZPIECZEŃSTWA","PORTA DE SEGURANÇA","ÎNCHIDERE DE SECURITATE","ЗАКРЫВАЮЩАЯСЯ ШЛЯПА","BEZPEČNOSTNÝ UZÁVER","VARNOSTNO ZAPIRANJE","TRAMPILLA ANTI-INTRUSIÓN","SÄKERHETSSTÄNGNING","Verschlusskappe","GÜVENLİK KAPATMA","BIZTONSÁGI ZÁR"]
[48,"Trad48","TIPO PIEDINI","TYP NOHY","脚踏类型","VRSTA NOGE","TYPE DE PIED","脚の種類","ΤΥΠΟΣ ΠΟΔΙΩΝ","FEET TYPE","PĒDU TIPS","TYP STÓP","TIPO DE PÉS","TIP PICIOARE","ТИП НОГИ","TYP PÔD","TIP STOPAL","TIPO DE PIES","FÖTTYP","Fuß-typ","AYAK TİPİ","LÁBAK TÍPUSA"]
[49,"Trad49","PIEDINI REGOLABILI","NASTAVITELNÉ NOŽIČKY","可调节脚踏","PRILAGODLJIVE NOGE","PIEDS RÉGLABLES","調整可能な脚","ΡΥΘΜΙΖΟΜΕΝΑ ΠΟΔΙΑ","ADJUSTABLE FEET","REGULĒJAMAS KĀJAS","REGULOWANY SPÓD","PÉS AJUSTÁVEIS","PICIOARE REGLABILE","РЕГУЛИРУЕМЫЕ НОЖКИ","NASTAVITEĽNÉ NOŽIČKY","NASTAVLJIVE NOGE","PIES AJUSTABLES","JUSTERBARA FÖTTER","STELLFÜSSE","AYARLANABİLİR AYAK","ÁLLÍTHATÓ LÁBAK"]
[50,"Trad50","PIEDINI SNODATI","SKLOPNÉ NOHY","铰链式脚踏","RASKLOPLJIVE NOGE","PIEDS ARTICULE'","ヒンジ付脚","ΚΑΛΥΜΕΝΑ ΠΟΔΙΑ","HINGED FEET","PĒDAS AR EŅĢĒM","STOPKI NA ZAWIASACH","PÉ ROTULADO","PICIOARE CU BALAMALE","СОЕДИНЕННЫЕ НОГИ","PODPÄTIA NA KĽÚČIKOCH","NOGE S KOTIČKAMI","PIES ARTICULADOS","GÅNGADE FÖTTER","einstellbare Füße","MENTEŞELİ AYAK","FELSZERELHETŐ LÁBAK"]
[51,"Trad51","GANCIO PER SCALE","HÁK PRO ŽEBŘÍKY","梯子挂钩","KUKA ZA LJESTVE","CINTRE POUR ESCALIER","梯子用フック","ΓΑΝΤΖΟΣ ΓΙΑ ΣΚΑΛΕΣ","HOOK FOR LADDERS","ĀĶIS KĀPNĒM","HAKI DO DRABIN","ANZOL PARA ESCADAS","CÂRLIG PENTRU SCĂRI","ВЕШАЛКА ДЛЯ ЛЕСТНИЦЫ","HÁK NA REBRÍKY","KAVELJ ZA LESTVE","GANCHO PARA ESCALERAS","HOOK FÖR LADDERS","Leiterhaken","MERDİVEN KANCA","LÉTRA AKASZTÓK"]
[52,"Trad52","MANIGLIONI","ZÁBRADLÍ","手柄","RUČKE","POIGNÉE","ハンドル","ΛΑΒΕΣ","HANDLES","ROKTURI","UCHWYTY","CORRIMÃO","MÂNERE","РУЧКА","ÚCHYTKY","ROČKE","MANIJAS","HANDTAG","HANDLAUF","KOLLAR","KAPASZKODÓK"]
[53,"Trad53","MODULI SCALE","ŽEBŘÍKOVÉ MODULY","梯子组件","MODULI LJESTAVA","MODULES D'ÉCHELLE","梯子モジュール","ΤΜΗΜΑΤΑ ΣΚΑΛΑΣ","LADDER MODULS","Kāpņu MODUļi","MODUŁY DRABINOWE","MÓDULOS DE ESCADAS","MODULURI PENTRU SCĂRIȚĂ","ЛЕСТНИЧНЫЕ МОДУЛИ","MODULY ŽEBRÍKOV","MODULI ZA LESTVICE","MÓDULOS DE ESCALERA","LADDER MODULS","Leitermodule","MERDİVEN MODÜLLERİ","LÉTRA MODULOK"]
[54,"Trad54","PZ","POČET","件","PCS","PZ","個数","ΤΕΜ","PCS","Gab","SZT","Pcs","PCS","PZ","PCS","PCS","UD","PCS","Stk.","PC'ler","DB"]
[55,"Trad55","Gruppo","Skupina","小组","Skupina","Groupe","グループ","Ομάδα","Group","Grupa","Grupa","Grupo","Grup","Группа","Skupina","Skupina","Grupo","Grupp","Gruppe","Grup","Csoport"]
[56,"Trad56","ASTE GABBIA","PROFILOVÉ TYČE PRO KOŠ","笼条","ŠIPKE ZA KAVEZ","TIGES DE CAGE","ケージバー","ΚΑΓΚΕΛΑ","CAGE BARS","Karkasa stieņi","PRĘTY KLATKI","BARRAS DA GAIOLA","BARE DE CUȘCĂ","СТЕРЖНИ КЛЕТКИ","KLIETKOVÉ TYČE","KLETKE ZA KLETKE","BARRAS DE JAULA","CAGE BARS","Käfigstangen","KAFES BARLAR","RÁCS ELEMEK"]
[57,"Trad57","ANELLI","PRSTENCE KOŠE","环","PRSTENOVI","BAGUES","リング","ΔΑΧΤΥΛΙΔΙΑ","RINGS","GREDZENI","OBRĘCZE","ANEIS","ANULE","КОЛЬЦА","KRÚŽKY","OBROČKI","ANILLOS","RINGAR","RINGE","YÜZÜKLER","GYŰRŰK"]
[58,"Trad58","STAFFE","DRŽÁK NA STĚNU","支架","NOSAČI","SUPPORTS","ブラケット","ΛΑΒΕΣ","BRACKETS","STIPRINĀJUMI","WSPORNIKI","BRACKETS","BRAȚE","КРЕПЕЖ","DRŽIAKY","OHRANILA","SOPORTE","FÄSTER","Klammern","PARANTEZ","TARTÓK"]
[59,"Trad59","GIUNZIONI","ŽEBŘÍKOVÝ SPOJ","连接件","SPOJEVI","JOINTS","ジャンクション","ΣΥΝΔΕΣΕΙΣ","JUNCTIONS","SAVIENOJUMI","WĘZŁY","JUNÇÕES","JUNCȚIUNI","СОЮЗЫ","JUNCTIONS","JUNCTIONS","ARTICULACIONES","JUNCTIONS","Verbindung","KAVŞAKLAR","TOLDÓK"]
[60,"Trad60","TAPPI","KRYTKY","帽子","KAPE","CAPS","キャップ","CAPS","CAPS","Nosegi","NASADY","CAPS","CAPS","CAPS","KAPSY","ZAHTEVE","TAPONES","CAPS","Kappen","BÜYÜK HARF","VÉGELEM"]
[61,"Trad61","TARGHETTA","ŠTÍTEK","标签","OZNAKA","TAG","ラベル","ΕΤΙΚΕΤΑ","LABEL","Norādījumu plāksne","ETYKIETA","TARGA","ETICHETA","TAG","ŠTÍTKY","ETIKETE","TARJETA","MÄRKA","Typenschild","ETİKET","CÍMKE"]
[62,"Trad62","FISSAGGI","UPEVNĚNÍ","紧固件","PRIČVRŠĆIVANJE","FIXATIONS","締結具","ΣΤΕΡΕΩΣΕΙΣ","FASTENINGS","Stiprinājumi","MOCOWANIA","FIXAÇÕES ","FIXAȚII","ФИКСИРОВАНИЕ","PRÍSLUŠENSTVO","PRITRDILNI ELEMENTI","FIJACIONES","FÄSTNINGAR","Befestigung","BAĞLANTILAR","RÖGZÍTŐK"]
[63,"Trad63","FISSAGGI STAFFE","UPEVNĚNÍ DRŽÁKŮ","支架固定件","FIKSIRANJE NOSAČA","FIXATIONS DES SUPPORTS","ブラケットの締結具","ΣΤΕΡΕΩΣΕΙΣ ΛΑΒΩΝ","BRACKETS FIXINGS","KRONŠTEINu STIPRINĀJUMI","MOCOWANIA WSPORNIKÓW","FIXAÇÕES DOS SUPORTES","SUPORTURI DE FIXARE","КРЕПЛЕНИЯ КРОНШТЕЙНОВ","DRŽIAKY UPEVŇOVACIE PRVKY","NOSILCI ZA PRITRDITEV","FIJACIÓN DE SOPORTES","FÄSTE Fästningar","Klammerbefestigung","BRAKET BAĞLANTILARI","KONZOLOK RÖGZÍTÉSEK"]
[64,"Trad64","FISSAGGIO INTERMEDIO","MEZILEHLÉ UPEVNĚNÍ","中间固定装置","FIKSIRANJE SREDNJIH NOSAČA","FIXATION INTERMÉDIAIRE","中間部の締結","ΕΝΔΙΑΜΕΣΗ ΣΤΕΡΕΩΣΗ","INTERMEDIATE FIXING","STARPPOSMA STIPRINĀJUMS","MOCOWANIE POŚREDNIE","FIXAÇÃO INTERMÉDIA","FIXARE INTERMEDIARĂ","ПРОМЕЖУТОЧНОЕ КРЕПЛЕНИЕ","MEDZIĽAHLÉ UPEVNENIE","VMESNA PRITRDITEV","FIJACIÓN INTERMEDIA","MELLANFIKTNING","ZWISCHENBEFESTIGUNG","ARA SABİTLEME","KÖZBENSŐ RÖGZÍTÉS"]
[65,"Trad65","LINGUA TARGHETTA","JAZYKOVÁ VERZE ŠTÍTKU","标签语言","JEZIK NA  OZNACI","LANGUE DE LA PLAQUE SIGNALÉTIQUE","ラベルの言語","ΓΛΩΣΣΑ ΕΤΙΚΕΤΩΝ","LABEL LANGUAGE","Norādījumu plāksnes VALODAS","JĘZYK ETYKIETY","IDIOMA DA TARGA","LIMBA ETICHETEI","ПЛАСТИНЧАТЫЙ ЯЗЫЧОК","JAZYK ŠTÍTKA","JEZIK OZNAČBE","IDIOMA DE LA TARJETA","ETIKETTSPRÅK","TYPENSCHILDSPRACHE","ETİKET DİLİ","CÍMKE NYELVE"]
[66,{"$f":"+_xlfn.CONCAT(\"Trad\",A66)","v":"Trad66"},"ESTENSIONE SUPERIORE","HORNÍ ROZŠÍŘENÍ","上部延伸件","GORNJE PROŠIRENJE","EXTENSION SUPÉRIEURE","上部の延長","ΑΝΩ ​​ΕΠΕΚΤΑΣΗ","UPPER EXTENSION","AUGŠĒJAIS PAGARINĀJUMS","PRZEDŁUŻENIE GÓRNE","EXTENSÃO SUPERIOR","EXTENSIE SUPERIOARĂ","ВЕРХНЕЕ РАСШИРЕНИЕ","HORNÝ NADSTAVEC","ZGORNJI PODALJŠEK","EXTENSIÓN SUPERIOR","ÖVRE UTVIDGNING","OBERE VERLÄNGERUNG","ÜST UZANTI","FELSŐ MEGHOSSZABBÍTÁS"]
[67,"Trad67","INTERASSE INTERMEDI","STŘEDOVÉ ROZPĚTÍ","中间跨度","SREDNJI PROSTOR","EMPATTEMENT INTERMÉDIAIRE","中間スパン","ΕΝΔΙΑΜΕΣΟ ΑΝΟΙΓΜΑ","INTERMEDIATE SPAN","STARPPOSMS","POŚREDNIA ROZPIĘTOŚĆ","VÃO INTERMÉDIO","EXTENSIE INTERMEDIARĂ","ПРОМЕЖУТОЧНАЯ КОЛЁСНАЯ БАЗА","MEDZIĽAHLÉ ROZPÄTIE","VMESNI RAZPON","DISTANCIA ENTRE INTERMEDIOS","MELLANMELLAN SPAN","ZWISCHENRADSTAND","ORTA AÇIKLIK","KÖZBENSŐ FESZTÁVOLSÁG"]
[68,"Trad68","INTERASSE 5 MT (SUGGERITO)","ROZPĚTÍ 5 M (DOPORUČENÁ)","跨度5米（建议）。","PROSTOR 5 MT (PREPORUČENO)","DISTANCE CENTRALE 5 MT (SUGGÉRÉE)","スパン5M（推奨）","ΑΝΟΙΓΜΑ 5 MT (ΠΡΟΤΕΙΝΟΜΕΝΟ)","SPAN 5 MT (SUGGESTED)","STARPPOSMS 5 MT (IETEICAMAIS)","ROZPIĘTOŚĆ 5 MT (SUGEROWANA)","INTERVALO DE 5 MT (SUGERIDO)","DESCHIDERE 5 MT (SUGERATĂ)","МЕЖОСЕВОЕ РАССТОЯНИЕ 5 МТ (ПРЕДЛАГАЕТСЯ)","ROZPÄTIE 5 MT (NAVRHOVANÉ)","RAZPON 5 MT (PREDLAGANO)","DIST. ENTRE EJES 5 MT (SUGERIDO)","SPAN 5 MT (FÖRESLAGT)","ACHSABSTAND 5 MT (VORGESCHLAGEN)","AÇIKLIK 5 MT (ÖNERİLEN)","FESZTÁVOLSÁG 5 M (JAVASOLT)"]
[69,"Trad69","NESSUN INTERMEDIO","ŽÁDNÝ MEZIPRODUKT","没有中间件","NEMA SREDNJEG","PAS D'INTERMÉDIAIRE","中間なし","ΟΧΙ ΕΝΔΙΑΜΕΣΟ","NO INTERMEDIATE","BEZ STARPPOSMA","BRAK POŚREDNICH","SEM INTERMÉDIO","FĂRĂ INTERMEDIAR","БЕЗ ПРОМЕЖУТОЧНЫХ","BEZ MEDZIPODSTAVCA","BREZ VMESNEGA","NINGÚN INTERMEDIO","INGEN mellanliggande","keine Zwischenhalterung","ARA YOK","NINCS KÖZTESELEM"]
[70,"Trad70","N.1 INTERMEDIO","N.1 MEZIPRODUKT","1号中间件","Br. 1 SREDNJI","N.1 INTERMÉDIAIRE","No.1中間","Νο 1 ΕΝΔΙΑΜΕΣΟ","No. 1 INTERMEDIATE","Nr. 1 starpposms","Nr 1 POŚREDNI","Nº 1 INTERMÉDIO","Nr. 1 INTERMEDIAR","N.1 ПРОМЕЖУТОЧНЫЙ","č. 1 MEDZINÁRODNÉ","št. 1 INTERMEDIATE","N.1 INTERMEDIO","Nr 1 MELLANMELLAN","1 Zwischenhalterung","1 ORTA","1. sz. KÖZTES ELEM"]
[71,"Trad71","N.2 INTERMEDIO","N.2 MEZIPRODUKT","2号中间件","Br. 2 SREDNJI","N.2 INTERMÉDIAIRE","No.2中間","Αρ. 2 ΕΝΔΙΑΜΕΣΟΙ","No. 2 INTERMEDIATES","Nr. 2 starpposmi","Nr 2 POŚREDNIKI","N.º 2 INTERMÉDIOS","Nr. 2 INTERMEDIARI","N.2 ПРОМЕЖУТОЧНЫЙ","č. 2 MEDZINÁRODNÉ","št. 2 MEDNARODNI","N.2 INTERMEDIO","Nr 2 mellanhänder","2 Zwischenhalterung","2 ARA ÜRÜNLER","2. sz. KÖZTES ELEM"]
[72,"Trad72","N.3 INTERMEDIO","N.3 MEZIPRODUKT","3号中间件","Br. 3 SREDNJI","N.3 INTERMÉDIAIRE","No.3中間","Αρ. 3 ΕΝΔΙΑΜΕΣΟΙ","No. 3 INTERMEDIATES","Nr. 3 starpposmi","Nr 3 POŚREDNIKI","N.º 3 INTERMÉDIOS","Nr. 3 INTERMEDIARI","N.3 ПРОМЕЖУТОЧНЫЙ","č. 3 MEDZINÁRODNÉ","št. 3 SREDNJEŠOLAKI","N.3 INTERMEDIO","Nr 3 INTERMEDIATER","3 Zwischenhalterung","3 ARA ÜRÜNLER","3. sz. KÖZTES ELEM"]
[73,"Trad73","N.4 INTERMEDIO","N.4 MEZIPRODUKT","4号中间件","Br. 4 SREDNJI","N.4 INTERMÉDIAIRE","No.4中間","Αριθ. 4 ΕΝΔΙΑΜΕΣΟΙ","No. 4 INTERMEDIATES","Nr. 4 starpposmi","Nr 4 POŚREDNIKI","N.º 4 INTERMÉDIOS","Nr. 4 INTERMEDIARI","N.4 ПРОМЕЖУТОЧНЫЙ","č. 4 INTERMEDIÁTI","št. 4 INTERMEDIATI","N.4 INTERMEDIO","Nr 4 mellanhänder","4 Zwischenhalterung","4 ARA ÜRÜNLER","4. sz. KÖZTES ELEM"]
[74,"Trad74","N.5 INTERMEDIO","N.5 MEZIPRODUKT","5号中间件","Br. 5 SREDNJI","N.5 INTERMÉDIAIRE","No.5中間","Νο 5 ΕΝΔΙΑΜΕΣΟΙ","No. 5 INTERMEDIATES","Nr. 5 starpposmi","Nr 5 POŚREDNIKI","No. 5 INTERMÉDIOS","Nr. 5 INTERMEDIARI","N.5 ПРОМЕЖУТОЧНЫЙ","č. 5 STREDNODOBÍ","št. 5 INTERMEDIATI","N.5 INTERMEDIO","Nr 5 mellanhänder","5 Zwischenhalterung","5 ARA ÜRÜNLER","5. sz. KÖZTES ELEM"]
[75,"Trad75","NAVETTA INCLUSA","VČETNĚ JEZDCE","包括滑梭","UKLJUČENA ŠUTLA","NAVETTE INCLUSE","シャトル同梱","ΠΕΡΙΛΑΜΒΑΝΕΤΑΙ ΤΟ SHUTTLE","INCLUDED SHUTTLE","Slīdnis ietverts","TRANSPORT W ZESTAWIE","INCLUI SHUTTLE","NAVETĂ INCLUSĂ","ТРАНСФЕР ВКЛЮЧЕН","VRÁTANE KYVADLOVEJ DOPRAVY","VKLJUČENI SHUTTLE","CARRIL INCLUIDO","INKLUDERAD SKYDD","GLEITER INBEGRIFFEN","DAHİL SERVİS","A KOCSIT TARTALMAZZA"]
[76,"Trad76","MANIGLIE","RUKOJEŤE","手柄","RUČKE","POIGNÉES","ハンドル","ΧΕΙΡΟΛΑΒΕΣ","HANDLES","Rokturi","UCHWYTY","CORRIMÃO","MANELE","РУЧКИ","HANDLES","ROČKE","MANETA","HANDTAG","GRIFFE","KOLLAR","KAPASZKODÓK"]
[77,"Trad77","FISSAGGIO ALLA BASE","UPEVNĚNÍ ZÁKLADNY","底座固定装置","OSNOVNO FIKSIRANJE","FIXATION À LA BASE","ベース締結","ΣΤΕΡΕΩΣΕΙΣ ΒΑΣΕΩΝ","BASE FIXINGS","BĀZES STIPRINĀJUMI","MOCOWANIA PODSTAWOWE","FIXAÇÕES DA BASE","FIXAȚII DE BAZĂ","КРЕПЛЕНИЕ К ОСНОВАНИЮ","ZÁKLADŇOVÉ PRÍSLUŠENSTVO","OHRANITVE ZA BAZO","FIJACIÓN A LA BASE","BASFIKSNINGAR","BEFESTIGUNG AN DER BASIS","TABAN DÜZENLEMELERİ","ALSÓ RÖGZÍTÉSEK"]
[78,"Trad78","RINFORZO PER SCALE","ZPEVNĚNÍ SCHODŮ","梯子加固","OJAČANJE LJESTAVA","RENFORCEMENT DES ESCALIERS","梯子の補強","ΕΝΙΣΧΥΣΗ ΣΚΑΛΩΝ","LADDER REINFORCEMENT","KĀPŅU NOSTIPRINĀŠANA","WZMOCNIENIE DRABINKI","REFORÇO DE ESCADA","CONSOLIDAREA SCĂRII","УКРЕПЛЕНИЕ СТУПЕНЕЙ","VYSTUŽENIE REBRÍKA","OJAČITEV LESTVE","REFUERZO DE ESCALERAS","LADDERFORSTÄRKNING","TREPPENBEWEHRUNG","MERDİVEN GÜÇLENDİRME","LÉTRA MEGERŐSÍTÉS"]
[79,"Trad79","Totale","Celkem","总数","UKUPNO","TOTAL","合計","ΣΥΝΟΛΟ","TOTAL","KOPĀ","CAŁKOWITY","TOTAL","TOTAL","ВСЕГО","SPOLU","SKUPAJ","TOTAL","TOTAL","gesamt","TOPLAM","ÖSSZES"]
[80,"Trad80","Totale prezzo Netto","Celková cena Netto","总净价","Ukupna neto cijena","PRIX NET TOTAL","税抜き合計価格","Συνολική Καθαρή Τιμή","Total Net Price","Kopējā neto cena","Całkowita cena netto","Preço total líquido","Preț net total","ОБЩАЯ ЧИСТАЯ ЦЕНА","Celková čistá cena","Skupna neto cena","PRECIO NETO TOTAL","Totalt nettopris","Gesamtpreis netto","Toplam Net Fiyat","Teljes nettó ár"]
[81,"Trad81","Info Cliente","Informace o zákazníkovi","客户数据","Podaci o klijentima","Données du client","顧客データ","Δεδομένα πελατών","Client data","Klienta dati","Dane klienta","Dados do cliente","Date despre client","Данные клиента","Údaje o klientovi","Podatki o stranki","Datos del cliente","Kunddata","Kundendaten","müşteri verileri","Ügyfél adatai"]
[82,"Trad82","Numero Cliente","Číslo zákazníka","客户编号","Broj klijenta","Numéro de client","顧客番号","Αριθμός πελάτη","Client Number","Klienta numurs","Numer klienta","Número de cliente","Numărul clientului","Номер клиента","Číslo klienta","Številka stranke","Número de cliente","Klient nummer","Kundennummer","Müşteri numarası","Ügyfél száma"]
[83,"Trad83","Codice Semiramis","Kód Semiramis","Semiramis代码","SemiramIS kod","Code Semiramis","セミラミスコード","Κώδικας Semiramis","Semiramis Code","Semiramis kods","Kod Semiramis","Código Semiramis","Cod Semiramis","Код Семирамиды","Kód Semiramis","Koda Semiramis","Código Semiramis","Semiramis -kod","Semiramis-Code","Semiramis Kodu","Semiramis kód"]
[84,"Trad84","Nome Cliente","Jméno zákazníka","客户名称","ime klijenta","Nom du client","顧客名","Όνομα Πελάτη","Client Name","Klienta nosaukums","Nazwa klienta","Nome do cliente","Numele clientului","имя клиента","Názov klienta","Ime stranke","Nombre del cliente","Kundnamn","Name des Kunden","Müşteri Adı","Ügyfél neve"]
[85,"Trad85","Email ","E-mail ","电子邮件","E -pošta","Courriel","Eメール","ΗΛΕΚΤΡΟΝΙΚΗ ΔΙΕΥΘΥΝΣΗ","Email","E-pasts","E-mail","Email","Email","Электронное письмо","E-mail","Elektronska pošta","Correo electrónico","E-post","E-Mail","E-posta","E-mail"]
[86,"Trad86","Telefono","Telefon","电话","Telefon","Téléphone","電話","Τηλέφωνο","Phone","Tālrunis","Telefon","Telefone","Telefon","Телефон","Telefón","Telefon","Teléfono","Telefon","Telefon","Telefon","Telefon"]
[87,"Trad87","Sito Web","Internetové stránky","网站","Web stranica","Site web","Webサイト","Δικτυακός τόπος","Website","Tīmekļa vietne","Strona internetowa","Sítio Web","Site web","Веб-сайт","Webová stránka","Spletna stran","Sitio web","Hemsida","Website","İnternet sitesi","Weboldal"]
[88,"Trad88","Tecnico Commerciale","Technický obchodní zástupce","技术销售人员","Tehnički prodavač","Technico-commercial","テクニカルセールスマン","Τεχνικός πωλητής","Technical Salesman","Tehniskais pārdevējs","Sprzedawca techniczny","Técnico Comercial","Vânzător tehnic","Технический продавец","Technický predajca","Tehnični prodajalec","Técnico Comercial","Teknisk säljare","Technischer Verkäufer","Teknik Satıcı","Műszaki értékesítő"]
[89,"Trad89","Partita IVA","DIČ","增值税号码","PDV broj","Numéro de TVA","VAT番号","Αριθμός ΦΠΑ","VAT Number","PVN maksātāja numurs","Numer VAT","Numero Fiscal IVA","Număr de TVA","Номер НДС","Číslo DPH","Številka DDV","Número de IVA","Momsregistreringsnummer","MwSt.-Nummer","KDV Numarası","Adószám"]
[90,"Trad90","Codice IBAN","Kód IBAN","IBAN代码","IBAN BROJ","Code IBAN","IBANコード","Κωδικός IBAN","IBAN Code","IBAN kods","Kod IBAN","Código IBAN","Cod IBAN","IBAN-код","Kód IBAN","Koda IBAN","Código IBAN","Iban-nummer","IBAN","IBAN numarası","IBAN kód"]
[91,"Trad91","Codice SWIFT","Kód SWIFT","SWIFT代码","SWIFT BROJ","Code SWIFT","SWIFTコード","Κωδικός SWIFT","SWIFT Code","SWIFT kods","Kod SWIFT","Código SWIFT","Cod SWIFT","SWIFT-код","Kód SWIFT","Koda SWIFT","Código SWIFT","SWIFT -kod","SWIFT-Code","Swift kodu","SWIFT-kód"]
[92,"Trad92","Indirizzo Fatturazione","Fakturační adresa","开票地址","Adresa za slanje računa","Adresse de facturation","請求先住所","διεύθυνση χρέωσης","Billing Address","Norēķinu adrese","Adres rozliczeniowy","Endereço para facturação","Adresa de facturare","Адрес для выставления счета","Fakturačná adresa","Obračunski naslov","Dirección de facturación","Fakturaadress","Rechnungsadresse","Fatura Adresi","Számlázási cím"]
[93,"Trad93","Via","Ulice","街道","Ulica","Rue","*noi non usiamo","Δρόμος","Street","Iela","Ulica","Rua","Strada","улица","Ulica","Ulica","Calle","Gata","Straße","sokak","Utca"]
[94,"Trad94","Città","Město","城市","Grad","Ville","市町村","Πόλη","City","Pilsēta","Miasto","Cidade","Oraș","Город","Mesto","Mesto","Ciudad","Stad","Stadt","Şehir","Város"]
[95,"Trad95","CAP","PSČ","邮政编码","Poštanski broj","Code postal","郵便番号","Ταχυδρομικός κώδικας","ZIP Code","Pasta indeks","Kod pocztowy","Código Postal","Cod poștal","Почтовый индекс","PSČ","Poštna številka","Código postal","Postnummer","Postleitzahl","Posta kodu","Irányítószám"]
[96,"Trad96","Nazione","Země","国家","Zemlja","Pays","国","Χώρα","Country","Valsts","Kraj","País","Țara","Страна","Krajina","Država","País","Land","Land","Ülke","Ország"]
[97,"Trad97","Provincia","Kraj","省份","Pokrajina","Province","都道府県","Επαρχία","Province","Province","Województwo","Distrito","Provincie","Провинция","Provincia","Pokrajina","Provincia","Provins","Bundesland","Vilayet","Megye"]
[98,"Trad98","Indirizzo per la Spedizione","Dodací adresa","送货地址","Adresa dostave","Adresse de livraison","配送先住所","Διεύθυνση παράδοσης","Delivery Address","Piegādes adrese","Adres dostawy","Endereço de entrega","Adresa de livrare","Адресс доставки","Doručovacia adresa","Naslov za dostavo","Dirección de entrega","Leveransadress","Lieferadresse","Teslimat adresi","Szállítási cím"]
[99,"Trad99","Listino Prezzi e Valuta","Ceník a měna","价格表和货币","Cjenik i valuta","Liste de prix et devise","価格表と通貨","Τιμοκατάλογος και Νόμισμα","Price List and Currency","Cenrādis un valūta","Cennik i waluta","Lista de Preços e Moeda","Lista de prețuri și moneda","Прейскурант и валюта","Cenník a mena","Cenik in valuta","Lista de precios y moneda","Prislista och valuta","Preisliste und Währung","Fiyat Listesi ve Para Birimi","Árlista és pénznem"]
[100,"Trad100","Fatturato","Obrat","营业额","Promet","Chiffre d'affaires","売上高","Τζίρος","Turnover","Apgrozījums","Obrót","Volume de negócios","Cifra de afaceri","Оборот","Obrat","Promet","Facturación","Omsättning","Umsatz","Devir","Forgalom"]
[101,"Trad101","LINEA PRODOTTO","PRODUKTOVÁ SKUPINA","产品系列","LINIJA PROIZVODA","LIGNE DE PRODUITS","生産ライン","ΓΡΑΜΜΗ ΠΑΡΑΓΩΓΗΣ","PRODUCT LINE","PRODUKTA LĪNIJA","LINIA PRODUKCYJNA","LINHA DE PRODUTOS","LINIE DE PRODUSE","ЛИНИЯ ПРОДУКЦИИ","PRODUKTOVÁ LÍNIA","LINIJA IZDELKOV","LÍNEA DE PRODUCTOS","PRODUKTLINJE","PRODUKTLINIE","ÜRÜN HATTI","TERMÉKCSALÁD"]
[102,"Trad102","PUNTI SINGOLI ","JEDNOTLIVÉ KOTVÍCÍ BODY ","单一锚点","SIDRENE TOČKE","POINTS D'ANCRAGE UNIQUES","シングルアンカーポイント","ΜΟΝΑ ΣΗΜΕΙΑ ΑΓΚΥΡΩΣΗΣ","SINGLE ANCHOR POINTS","ATSEVIŠĶI STIPRINĀJUMA PUNKTI","POJEDYNCZE PUNKTY KOTWICZĄCE","PONTOS ÚNICOS DE ANCORAGEM","PUNCTE DE ANCORARE UNICE","ОДИНОЧНЫЕ ТОЧКИ КРЕПЛЕНИЯ","JEDNOTLIVÉ KOTVIACE BODY","POSAMEZNE SIDRNE TOČKE","PUNTOS ÚNICOS","ENKELA ANKERPUNKTER","Einzelanschlagspunkte","TEK ANKRAJ NOKTALARI","EGYÉNI KIKÖTÉSI PONTOK"]
[103,"Trad103","LINEE VITA","LANKOVÝ SYSTÉM","生命线","ŽIVOTNE LINIJE","LIGNES DE VIE","ライフライン","ΓΡΑΜΜΕΣ ΖΩΗΣ","LIFE LINES","Drošības LĪNIJAS","LINIE ŻYCIA","LINHAS DE VIDA","LINII DE VIAȚĂ","ЛИНИИ ЖИЗНИ","ŽIVOTNÉ LÍNIE","ŽIVLJENJSKE LINIJE","LÍNEAS DE VIDA","LIVSLINJER","LEBENSLINIEN","YAŞAM HATLARI","KÁBELES RENDSZEREK"]
[104,"Trad104","SUPPORTI","NOSIČE","支撑物","PODRŠKE","SUPPORTS","サポート","ΥΠΟΣΤΗΡΙΓΜΑΤΑ","SUPPORTS","ATBALSTI","PODPORY","APOIOS","SUPORTURI","ПОДДЕРЖКИ","PODPORY","PODPORE","SOPORTES","STÖD","Grundplatten, Aufnahmen","DESTEKLER","TARTÓELEMEK"]
[105,"Trad105","COMPONENTI LINEE VITA","KOMPONENTY LANKOVÉHO SYSTÉMU","生命线组件","KOMPONENTE ŽIVOTNIH LINIJA","COMPOSANTS LIFE LINES","ライフラインコンポーネント","ΕΞΑΡΤΗΜΑΤΑ ΓΡΑΜΜΩΝ ΖΩΗΣ","LIFE LINES COMPONENTS","GLĀBŠANAS LĪNIJU KOMPONENTI","KOMPONENTY LINII ŻYCIA","COMPONENTES DAS LINHAS DE VIDA","COMPONENTE PENTRU LINIILE DE VIAȚĂ","КОМПОНЕНТЫ ЛИНИИ ЖИЗНИ","KOMPONENTY ZÁCHRANNÝCH LÍNIÍ","SESTAVNI DELI LINIJ LIFE LINE","COMPONENTES DE LÍNEAS DE VIDA","LIFE LINES KOMPONENTER","Komponenten Lebenslinien","YAŞAM HATLARI BİLEŞENLERİ","RENDSZERELEMEK"]
[106,"Trad106","ANTICADUTA","OCHRANA PROTI PÁDU","坠落保护","ZAŠTITA OD PADA","PROTECTION CONTRE LES CHUTES","墜落防止","ΠΡΟΣΤΑΣΙΑ ΑΠΌ ΠΤΩΣΗ","FALL PROTECTION","AIZSARDZĪBA PRET KRITIENIEM","OCHRONA PRZED UPADKIEM","PROTECÇÃO ANTI-QUEDA","PROTECȚIE ÎMPOTRIVA CĂDERILOR","ЗАЩИТА ОТ ПАДЕНИЯ","OCHRANA PROTI PÁDU","ZAŠČITA PRED PADCEM","PROTECCIÓN ANTICAÍDAS","FALLSKYDD","Absturzsicherung","DÜŞME TEHLİKESİNE KARŞİ KORUMA","LEESÉS ELLENI VÉDELEM"]
[107,"Trad107","PROTEZIONI COLLETTIVE","KOLEKTIVNÍ OCHRANA","集体防护","grupna ZAŠTITA","PROTECTION COLLECTIVE","共同保護具","ΣΥΛΛΟΓΙΚΗ ΠΡΟΣΤΑΣΙΑ","COLLECTIVE PROTECTION","KOLEKTĪVĀ AIZSARDZĪBA","OCHRONA ZBIOROWA","PROTECÇÃO COLECTIVA","PROTECȚIE COLECTIVĂ","КОЛЛЕКТИВНАЯ ЗАЩИТА","KOLEKTÍVNA OCHRANA","KOLEKTIVNA ZAŠČITA","PROTECCIÓN COLECTIVA","KOLLEKTIVT SKYDD","Kollektivschutz","TOPLU KORUMA","KOLLEKTÍV VÉDELEM"]
[108,"Trad108","DPI - DISPOSITIVI DI PROTEZIONE INDIVIDUALE","OSOBNÍ OCHRANNÉ PROSTŘEDKY","PPE - 个人防护设备","OZO - OSOBNA ZAŠTITNA OPREMA","PPE - ÉQUIPEMENT DE PROTECTION INDIVIDUELLE","PPE-個人用保護具","ΜΑΠ - ΕΞΟΠΛΙΣΜΟΣ ΠΡΟΣΩΠΙΚΗΣ ΠΡΟΣΤΑΣΙΑΣ","PPE - PERSONAL PROTECTION EQUIPMENT","PPE - INDIVIDUĀLIE AIZSARDZĪBAS LĪDZEKĻI","ŚOI - ŚRODKI OCHRONY OSOBISTEJ","EPI - EQUIPAMENTO DE PROTECÇÃO INDIVIDUAL","PPE - ECHIPAMENT DE PROTECȚIE PERSONALĂ","СИЗ - СРЕДСТВА ИНДИВИДУАЛЬНОЙ ЗАЩИТЫ","PPE - OSOBNÉ OCHRANNÉ PROSTRIEDKY","PPE - OSEBNA ZAŠČITNA OPREMA","PPE - EQUIPO DE PROTECCIÓN PERSONAL","PPE - PERSONLIGT SKYDDSUTRUSTNING","PSA - PERSÖNLICHE SCHUTZAUSRÜSTUNG","KKD - KİŞİSEL KORUMA EKİPMANI","PPE - EGYÉNI VÉDŐFELSZERELÉS"]
[109,"Trad109","ALTRE LINEE VITA","DALŠÍ LANKOVÉ ZÁCHYTNÉ SYSTÉMY","其他生命线","OSTALE ŽIVOTNE LINIJE","AUTRES LIGNES DE VIE","その他のライフライン","ΑΛΛΕΣ ΓΡΑΜΜΕΣ ΖΩΗΣ","OTHER LIFE LINES","CITAS GLĀBŠANAS LĪNIJAS","INNE LINIE ŻYCIA","OUTRAS LINHAS DE VIDA","ALTE LINII DE VIAȚĂ","ДРУГИЕ ЛИНИИ ЖИЗНИ","INÉ ZÁCHRANNÉ LANÁ","DRUGE ŽIVLJENJSKE LINIJE","OTRAS LÍNEAS DE VIDA","ANDRA LIVSLINJER","andere Lebenslinien","DİĞER YAŞAM HATLARI","EGYÉB RENDSZEREK"]
[110,"Trad110","CAVO IN ACCIAIO","OCELOVÝ KABEL","钢丝","ČELIČNA ŽICA","FIL D'ACIER","スティールワイヤ","ΑΤΣΑΛΙΝΟ ΣΥΡΜΑ","STEEL WIRE","TĒRAUDA troses","STALOWY DRUT","CABO DE AÇO","CABLU DE OȚEL","СТАЛЬНАЯ ПРОВОЛОКА","OCEĽOVÉ DRÔTY","JEKLENI VODNIKI","ALAMBRE DE ACERO","STÅLTRÅD","Stahlseil","ÇELİK TEL","ACÉLHUZAL"]
[111,"Trad111","Tasso di cambio:","Směnný kurz:","汇率：","Tečajna lista:","Taux de change :","為替レート：","Συναλλαγματική ισοτιμία:","Exchange Rate:","Valūtas maiņas kurss:","Kurs wymiany:","Taxa de Câmbio:","Curs de schimb:","Курс обмена:","Výmenný kurz:","Menjalni tečaj:","Tipo de cambio:","Växlingskurs:","Umrechnungskurs:","Döviz kuru:","Árfolyam:"]
[112,"Trad112","Pagamento ","Platba ","付款方式","Plaćanje","Paiement","支払い","Πληρωμή","Payment","Maksājums","Zapłata","Pagamento","Plata","Оплата","Platba","Plačilo","Pago","Betalning","Zahlung","Ödeme","Fizetési feltételek"]
[113,"Trad113","ORDINE","OBJEDNÁVKA","订单","NARUDŽBA","COMMANDE","注文","ΠΑΡΑΓΓΕΛΙΑ","ORDER","PASŪTĪjums","ZAMÓWIENIE","ENCOMENDA","COMANDĂ","ПРИКАЗ","OBJEDNÁVKA","NAROČILO","PEDIDO","BESTÄLLA","BESTELLUNG","EMİR","MEGRENDELÉS"]
[114,"Trad114","Rif.","Ref.","参考资料","Ref.","Réf.","参照","Αναφ.","Ref.","Ref.","Nr ref.","Ref.","Ref.","Ссылка","Ref.","Ref.","Ref.","Ref.","Ref.","Referans","Ref."]
[115,"Trad115","Data","Datum","日期","Datum","Date","日にち","Ημερομηνία","Date","Datums","Data","Data","Data","Дата","Dátum","Datum","Fecha","Datum","Datum","Tarih","Dátum"]
[116,"Trad116","Cellulare","Mobilní tel.:","手机","MoBILNI","Mobile","携帯電話","Κινητό","Mobile","Mobilais","mobilny","Telemovél","Mobil","Мобильный","Mobilný telefón","Mobilni telefon","Móvil","Mobil","Mobil","Mobil","Mobil"]
[117,"Trad117","Persona di riferimento","Kontaktní osoba","推荐人","Referentna osoba","Personne de référence","担当者","Πρόσωπο αναφοράς","Reference person","Atsauces persona","Osoba referencyjna","Pessoa de referência","Persoana de referință","Референтное лицо","Referenčná osoba","Referenčna oseba","Persona de referencia","Referens person","Bezugsperson","Aracı kişi","Kapcsolattartó"]
[118,"Trad118","Linea","Řádek","线路","Crta","Ligne","ライン","Γραμμή","Line","Līnija","Linia","Linha","Linia","Линия","Linka","Linija","Línea","Linje","Zeile","Hat","Vonal"]
[119,"Trad119","Qt.","Množství","季度","Qt.","Qt.","Qt","ΠΟΣΟΤΗΤΑ","Qt.","Skaits","Ilość","Qt.","Qt.","кв.","Qt.","Qt.","Qt.","Qt.","Anz.","Qt.","Qt."]
[120,"Trad120","Subtotale","Mezisoučet","小计","SubTotal","Sous-total","小計","ΜΕΡΙΚΟ ΣΥΝΟΛΟ","SubTotal","Starpsumma","Suma częściowa","SubTotal","SubTotal","Промежуточный итог","SubTotal","SubTotal","SubTotal","Delsumma","Zwischensumme","Ara toplam","Részösszeg"]
[121,"Trad121","Peso","Hmotnost","重量","Težina","Poids","重量","Βάρος","Weight","Svars","Waga","Peso","Greutate","Масса","Hmotnosť","Teža","Peso","Vikt","Gewicht","Ağırlık","Súly"]
[122,"Trad122","Note","Poznámky","备注","Bilješke","Notes","注記","Σημειώσεις","Notes","Piezīmes","Uwagi","Notas","Note","Примечания","Poznámky","Opombe","Notas","Anteckningar","Anmerkungen","Notlar","Megjegyzések"]
[123,"Trad123","Cliente","Zákazník","客户","Klijent","Client","顧客","Πελάτης","Client","Klients","Klient","Cliente","Client","Клиент","Klient","Stranka","Cliente","Klient","Kunde","Müşteri","Ügyfél"]
[124,"Trad124","RETI DI SICUREZZA","BEZPEČNOSTNÍ SÍTĚ","安全网","SIGURNOSNE MREŽE","FILETS DE SECURITE","セーフティネット","ΔΙΚΤΥΑ ΑΣΦΑΛΕΙΑΣ","SAFETY NETS","DROŠĪBAS TĪKLI","SIATKI BEZPIECZEŃSTWA","REDES DE SEGURANÇA","PLASE DE SIGURANȚĂ","ЗАЩИТНЫЕ СЕТКИ","BEZPEČNOSTNÉ SIETE","VARNOSTNE MREŽE","REDES DE SEGURIDAD","SÄKERHETSNÄT","SICHERHEITSNETZE","GÜVENLİK AĞLARI","BIZTONSÁGI HÁLÓ"]
[125,"Trad125","PARAPETTI","ZÁBRADLÍ","栏杆防护装置","ŠTITNICE ZA OGRADE","RAILINGS","手すりガード","ΠΑΡΑΠΕΤΙΑ","RAILING GUARDS","MARGU AIZSARGI","BALUSTRADY","PARAPEITOS","GĂRZILE DE PROTECȚIE A BALUSTRADELOR","ЗАЩИТА ПЕРИЛ","OCHRANNÉ ZÁBRADLIA","VAROVALA ZA OGRAJE","BARANDILLAS","RÄNGSKYDD","GELÄNDER","KORKULUK KORUMALARI","BIZTONSÁGI KORLÁT"]
[126,"Trad126","GANCI SCALE","HÁKY NA ŽEBŘÍKY","梯子吊钩","KUKE za ljestve","CROCHETS D'ÉCHELLE","梯子フック","ΑΓΚΥΣΤΡΑ ΓΙΑ ΣΚΑΛΕΣ","LADDERS HOOKS","Kāpņu āķi","HAKI DO DRABIN","GANCHO PARA ESCADAS","CÂRLIGE DE CĂRUCIOR","КРЮЧКИ ДЛЯ ЛЕСТНИЦ","HÁČKY NA VODIDLÁ","KLJUKE ZA VODILA","GANCHOS DE ESCALA","LADDERS HOOKS","Leiterhaken","MERDİVEN KANCALARI","LÉTRA AKASZTÓK"]
[127,"Trad127","CASCHI","PŘILBY","安全帽","kacige","HELMETS","ヘルメット","ΚΡΑΝΗ","HELMETS","Ķiveres","KASKI","CAPACETES","CĂȘTI DE PROTECȚIE","ШЛЕМЫ","PRILBY","PRIPOROČNIKI","CASCOS","HJÄLMAR","Helme","KASKLAR","SISAKOK"]
[128,"Trad128","IMBRACHI","ZACHYCOVACÍ POSTROJE","绳索","pojasevi","EMBALLAGE","ハーネス","ΖΩΝΕΣ","HARNESSES","Drošības sistēmas","SZELKI","ARNÊSES","HARNESSES","ЖГУТЫ","ZÁVESY","OHRANILA","EMBALAJE","HARNESS","Gurte","KOŞUMLAR","HEVEDEREK"]
[129,"Trad129","CORDINI","LANKOVÉ SYSTÉMY","绳索","DVORIŠTA","CORDINI","ランヤード","ΣΧΟΙΝΙΑ","LANYARDS","Drošības striķi","SMYCZE","CORDAS POSICIONAMENTO","LANYARDS","СТРЕПКИ","LANYARDS","LANYARDS","CORDONES","LANYARDS","Seile","LANYARLAR","BIZTONSÁGI KÖTELEK"]
[130,{"$f":"+_xlfn.CONCAT(\"Trad\",A130)","v":"Trad130"},"DISCENSORI","SLAŇOVACÍ BRZDA","感应器","UREĐAJI ZA SPUŠTANJE","DISCENSEURS","下降器","ΔΙΑΧΩΡΙΣΤΕΣ","DISCENSORS","Nolaidēji","DYSKENSORY","DESCENSORES","DISCENSORI","ДИССЕНСОРЫ","DISCENZORY","DISCENZORJI","DESCENDEDORES","DISCENSORER","Abseilgeräte","DİSKENSÖRLER","ERESZKEDŐK"]
[131,"Trad131","RETRATTILI","ZATAHOVACÍ ZÁCHYTNÉ ZAŘÍZENÍ","伸缩装置","UREĐAJI NA uvlačenje","RETRACTORS","リトラクタブルデバイス","ΣΥΣΚΕΥΕΣ ΑΝΑΚΤΗΣΗΣ","RETRACTABLE DEVICES","IEVELKAMAS IERĪCES","WYSUWANE URZĄDZENIA","DISPOSITIVOS RETRÁCTEIS","DISPOZITIVE RETRACTABILE","ВЫДВИЖНЫЕ УСТРОЙСТВА","VÝSUVNÉ ZARIADENIA","IZVLEČNE NAPRAVE","RETRÁCTILES","UTKASTBARA ENHETER","Höhensicherungsgerät","ÇEKİLEBİLİR CİHAZLAR","BEHÚZHATÓ ESZKÖZÖK"]
[132,"Trad132","POSIZIONAMENTO","POZICIOVÁNÍ","定位","POLOŽAJ","POSITIONNEMENT","ポジショニング","ΣΤΑΘΕΡΟΠΟΙΗΣΗ","POSITIONING","POZICIONĒŠANA","POZYCJONOWANIE","POSICIONAMENTO","POZIȚIONARE","ПОЗИЦИОНИРОВАНИЕ","POLOHOVANIE","POLOŽAJ","POSICIONAMIENTO","POSITIONERING","POSITIONIERUNG","KONUMLANDIRMA","POZÍCIONÁLÁS"]
[133,"Trad133","ANCORANTI","KOTVY","锚固装置","SIDRA","ANCERS","アンカー","ΑΓΚΥΡΙΑ","ANCHORS","Stiprinājums","KOTWY","ANCORANTES","ANCHETE","ЯКОРЯ","KOTVY","KOTVE","ANCLAJES","ANKRAR","Anker","ANCHORLAR","KIKÖTÉSI PONTOK"]
[134,"Trad134","CONNETTORI","SPOJKY","连接装置","PRIKLJUČCI","CONNECTEURS","コネクタ","ΣΥΝΔΕΣΜΟΙ","CONNECTORS","SAVIENOTĀJI","ZŁĄCZA","CONECTORES","CONECTORI","СОЕДИНИТЕЛИ","KONEKTORY","PRIKLJUČEVALCI","CONECTORES","ANSLUTNINGAR","Verbinder","KONEKTÖRLER","CSATLAKOZÓK"]
[135,"Trad135","TRIPODI","TROJNOŽKY","三脚架","TRIPODI","TRIPODS","三脚","ΤΡΙΠΟΔΕΣ","TRIPODS","Trijkāji","STATYWY","TRIPODS","TRIPODE","ШТАТИВЫ","TRIPODY","TRIPODI","TRIPODES","TRIPODER","Dreibein","TRİPODLAR","TRIPODOK"]
[136,"Trad136","BIPODI","DVOJNOŽKY","臂架","BIPODI","BIPODS","二脚","ΔΙΠΟΔΕΣ","BIPODS","Trijkāji","dwójnogi","BIPODS","BIPODE","сошки","BIPODY","BIPODI","BIPODES","BIPODS","Zweibein","BİPODLAR","BIPODOK"]
[137,"Trad137","GUANTI","RUKAVICE","护目镜","RUKAVICE","GANTS","グローブ","ΓΑΝΤΙΑ","GLOVES","Cimdi","RĘKAWICZKI","LUVAS","MÂINI","ПЕРЧАТКИ","RUKAVICE","ROKAVICE","GUANTES","HANDSKAR","HANDSCHUHE","ELDİVENLER","KESZTYŰK"]
[138,"Trad138","ORECCHIE","CHRÁNIČE SLUCHU","耳朵","UŠI","OREILLES","耳","ΑΥΤΙΑ","EARS","Ausis","USZY","ORELHAS","URECHI","УШИ","UŠI","UŠI","AURICULARES","ÖRON","Ohren","KULAKLAR","FÜLEK"]
[139,"Trad139","OCCHI","OCHRANA ZRAKU","眼睛","OČI","YEUX","目","ΜΑΤΙΑ","EYES","Acis","OCZY","OLHOS","OCHI","ГЛАЗА","OČI","OČI","CASCOS AUDITIVOS","ÖGON","AUGEN","GÖZLER","SZEMEK"]
[140,"Trad140","FISSAGGI","OPRAVY","固定装置","FIKSIRANJA","FIXATIONS","締結具","ΣΤΕΡΕΩΣΕΙΣ","FIXINGS","FIKSATORI","MOCOWANIA","FIXAÇÕES","FIXAȚII","КРЕПЛЕНИЯ","PRÍSLUŠENSTVO","PRIPOMBE","FIJACIONES","FIXERINGAR","Befestigung","DÜZENLEMELER","RÖGZÍTŐK"]
[141,"Trad141","SITEMI DI FISSAGGIO","UPEVŇOVACÍ SYSTÉMY","紧固件系统","SISTEMI PRIČVRŠČIVANJA","SYSTÈMES DE FIXATION","締結システム","ΣΥΣΤΗΜΑΤΑ ΣΤΕΡΕΩΣΗΣ","FASTENINGS SYSTEMS","STIPRINĀJUMU SISTĒMAS","SYSTEMY ZAMOCOWAŃ","SISTEMAS DE FIXAÇÃO","SISTEME DE FIXARE","СИСТЕМЫ КРЕПЛЕНИЯ","UPEVŇOVACIE SYSTÉMY","PRITRDILNI SISTEMI","SISTEMAS DE FIJACIÓN","FÄSTNINGSSYSTEM","BEFESTIGUNGSSYSTEME","BAĞLANTI SİSTEMLERİ","RÖGZÍTŐ RENDSZEREK"]
[142,"Trad142","Corrimano","Zábradlí","扶手栏杆","Rukohvat","Main courante","手すり","Κουπαστή","Handrail","Margas","Poręcz","Corrimão","Balustradă","Поручень","Zábradlie","Ograje","Pasamanos","Ledstång","Handlauf","Küpeşte","Kapaszkodó"]
[143,"Trad143","Dritto","Přímo","直立","RAVAN","Droit","真直ぐ","Στρέιτ","Straight","Taisni","Prosto","Direito","Streight","прямой","Priamy","Preproga","RECTO","Streight","Gerade","düz","Egyenes"]
[144,"Trad144","Inclinato","Nakloněný","倾斜的","NAGNUT","Incliné","傾斜","Κεκλιμένος","Inclined","Slīpi","Skłonny","Inclinado","Înclinat","Наклонный","Šikmé","Nagnjeno","Inclinado","Lutande","Geneigt","eğimli","Ferde"]
[145,"Trad145","Tavola Fermapiede","Okopová lišta","托板","ŠIRINA STOPALA","Planche de la main courante","トーボード","Πλάκα ποδιών","Toeboard","Kājas dēļis","Krawężnik","Tabuleiro","Toeboard","Носочная доска","Toeboard","Talna deska","Rodapié","Toeboard","Bordbrett","Süpürgelik","Bokaléc"]
[146,"Trad146","Prezzo Listino/ml","Cena/m","价格表/m","Cjenik/m","Liste de prix/ml","定価 / m","Τιμοκατάλογος/μ","Price List/m","Cenrādis/m","Cennik/m","Lista de preços/m","Lista de prețuri/m","Прайс-лист/м","Cenník/m","Cenik/m","Lista de precios/ml","Prislista/m","Preisliste/ml","Fiyat Listesi/m","Árlista/m"]
[147,"Trad147","Lingua","Jazyk","语言","Jezik","Langue","言語","Γλώσσα","Language","Valoda","Język","Idioma","Limba","Язык","Jazyk","Jezik","Idioma","Språk","Sprache","Dilim","Nyelv"]
[148,"Trad148","AUTOPORTANTE","SAMONOSNÁ /ZÁTĚŽOVÁ","弹力板","ISPUNJEN BALASTOM","AUTOPORTANT","自立","ΣΦΡΑΓΙΣΜΕΝΟ","BALLASTED","Ar atsvaru","BALASTOWANE","BALASTRO","BALLASTED","БАЛЛАСТ","BALLASTED","BALASTED","AUTOPORTANTE","BALLASTAD","SELBSTTRAGEND","BALASTLI","SÚLYOZOTT"]
[149,"Trad149","Montante","Vzpřímený","直立式","Uspravno","Debout","直立","Ορθιος","Upright","Vertikālais","Pionowo","Montante","Vertical","Вертикальный","Vzpriamená","Navpično","MONTANTE","Upprätt","Pfosten","Dik","Felálló"]
[150,"Trad150","Diritto","Přímý","直的","Ravno","Droit","真直ぐ","Ευθεία","Straight","Taisni","Proste","Alinhado","Drept","Прямой","Rovná","Ravna","Recto","Hetero","Gerade","Düz","Egyenes"]
[151,"Trad151","Corrente","Středová tyč","中间杆","SREDIŠNJA ŠIPKA","Actuel","中間バー","Ενδιάμεσο Μπάρα","Intermediate Bar","Starpposma stienis","Pośredni pasek","Barra intermédia","Bară intermediară","Промежуточный бар","Stredná tyč","Vmesna palica","CORRIENTE","Mellanliggande bar","Strom","Orta Çubuk","Köztes rúd"]
[152,"Trad152","Altezza Montante","Výška slouku","直立高度","GORNJA visina","Hauteur du mât","直立高さ","Όρθιο ύψος","Upright height","Vertikālais augstums","Wysokość w pionie","Altura montante","Înălțime verticală","Высота в вертикальном положении","Výška stojana","Višina pokončne mize","Altura del montante","Upprätt höjd","Pfostenhöhe","dik yükseklik","Magasság"]
[153,"Trad153","Normativa di riferimento","Referenční standard","规范性参考 ","Referentna norma","Norme de référence","参照基準","Κανονισμος","Reference Normative","Atsauces Normatīvs","Odniesienie normatywne","Norma de referência","Referință Normativ","Справочный норматив","Referenčná normatívna hodnota","Referenčna normativna","Normativa de referencia","Referens Normativ","Referenznorm","Referans Normatifi","Hivatkozás Normatív"]
[154,"Trad154","Composizione Parapetto","Složení zábradlí","护栏组成","Sastav ZAŠTITNE ograde","Composition du parapet","ガードレール構成","Σύνθεση προστατευτικού κιγκλιδώματος","Guardrail composition","Aizsargu margu sastāvs","Skład balustrady","Composição do parapeito","Compoziția balustradei","Состав ограждения","Zloženie zábradlia","Sestava ograje","Composición de la barandilla","Skyddsräckkomposition","Zusammensetzung der Brüstung","korkuluk bileşimi","VÉDŐKORLÁT ÖSSZEÁLLÍTÁSA"]
[155,"Trad155","Lunghezza totale parapetto","Celková délka zábradlí","护栏的总长度","Ukupna duljina zaštitne ograde","Longueur totale du parapet","ガードレール全長","Συνολικό μήκος προστατευτικού κιγκλιδώματος","Total length of guardrail","Aizsargu margas kopējais garums","Całkowita długość poręczy","Comprimento total do parapeito","Lungimea totală a parapetului de protecție","Общая длина ограждения","Celková dĺžka zábradlia","Skupna dolžina ograje","Longitud total de la barandilla","Total längd av räcke","Gesamtlänge der Brüstung","Toplam korkuluk uzunluğu","A korlát teljes hossza"]
[156,"Trad156","Angoli","Rohy","拐角","Kutovi","Coins","コーナー","Γωνίες","Corners","Stūri","Narożniki","Cantos","Colțuri","Углы","Rohy","Vogali","ángulos","Hörn","Ecken","köşeler","Sarkok"]
[157,"Trad157","Fissaggi a muro","Upevnění na stěnu","墙体固定装置","Zidni pričvršćivači","Fixations murales","壁の締結","Στερέωση τοίχων","Wall fixings","Sienas stiprinājumi","Mocowania ścienne","Fixações de parede","Fixări de perete","Крепления к стене","Upevnenie na stenu","Pritrditev na steno","Fijaciones a pared","Väggfästen","Befestigung an der Wand","Duvar sabitlemeleri","Fali rögzítések"]
[158,"Trad158","Terminali non a muro","Nestěnové svorky","非墙端","BEZ ZIDNIH ZAVRŠETAKA","Bornes non murales","壁の端ではない","Όχι άκρα τοίχου","Not wall ends","Ne sienas gali","Nie kończy się ściana","Não extremidades de parede","Nu la capetele pereților","Не кончается стена","Nie konce stien","Ne na koncih stene","No extremos a pared","Inte väggändar","Nicht-Wandterminals","Duvar bitmez","Nem fali végek"]
[159,"Trad159","Kit cancelletto","Dvířka set","闸门套件","Komplet za vrata","Porte du kit","ゲートキット","Κιτ Πύλης","Gate Kit","Vārtu komplekts","Zestaw bramek","Kit de Portão","Kit pentru poartă","Комплект ворот","Súprava brány","Komplet vrat","Kit de cerradura","Gate Kit","Bausatz Tor","Kapı Kiti","Kapu"]
[160,"Trad160","Versione Alu","Verze Alu","铝制版本","Alu verzija","Version Alu","Aluバージョン","Έκδοση Alu","Alu version","Alumīnija versija","Wersja alu","Versão Alu","Versiunea Alu","алюминиевая версия","Alu verzia","Različica iz aluminija","Versión de aluminio","Alu version","Alu-Ausführung","Alüminyum versiyonu","Alumínium változat"]
[161,"Trad161","Tipo Montante","Typ sloupku","直立型","Uspravan tip","Type de mât","直立タイプ","Όρθιος τύπος","Upright type","Statīvais tips","Typ pionowy","Tipo montante","Tip vertical","Вертикальный тип","Vzpriamený typ","Navpična izvedba","Tipo montante","Upprätt typ","Pfostentyp","dik tip","Támaszték típusa"]
[162,"Trad162","Arrodondamento ml","Zaokrouhlování v m","圆弧形ml","Zaokruživanje ml","Arrondissement ml","四捨五入したml","Στρογγυλοποίηση ml","Rounding ml","Noapaļojums ml","Zaokrąglanie ml","Arredondamento de ml","Rotunjire ml","Округление мл","Zaoblenie ml","Zaokrožitev ml","Redondeo ml","Avrundning ml","Rundung ml","Yuvarlama ml","Kerekítés ml"]
[163,"Trad163","Interasse Montanti","Rozteč sloupků","直立柱跨度","Raspon stupova","Espacement des poteaux","直立スパン","Όρθιο εύρος","Uprights span","Statņu diapazons","Rozpiętość słupków","Vão entre montantes","Ampatamentul montanților","Пролет стоек","Rozpätie stĺpikov","Razpon pokončnikov","Distancia entre montantes","Stolpar sträcker sig","Abstand zwischen den Pfosten","Direkler açıklığı","Támaszok fesztávolsága"]
[164,"Trad164","N. montanti","Počet sloupků","直立柱数量","Uspravi br.","Nombre de montants","直立番号","Όρθιοι αρ.","Uprights no.","Statņu skaits","Stojaki nr.","N.º de montantes.","Montanți nr.","Стойки нет.","Stojany č.","Št. pokončnih stebričkov","Número de montantes","Stolpar nr.","Anzahl der Stützen","Direkler hayır.","Támaszok száma"]
[165,"Trad165","Input n. montanti","Vstupní počet sloupků","输入直立柱数量","Ulazni stupovi br.","Nombre de montants en entrée","入力直立番号","Εισαγωγή Όρθιοι αρ.","Input Uprights no.","Statņu skaits","Słupki wejściowe nr.","Entrada num. de montantes","Intrare Nr. montanți nr.","Входные стойки нет.","Vstupné stĺpiky č.","Vhod Višine št.","Número de entrada de los montantes","Ingångsstolpar nr.","Eingabe Anzahl der Stützen","Giriş Direkleri no.","Bemeneti támaszok száma"]
[166,"Trad166","Larghezza","Šířka","宽度","Širina","Largeur","幅","Πλάτος","Width","Platums","Szerokość","Largura","Lățime","Ширина","Šírka","Širina","Ancho","Bredd","Breite","Genişlik","Szélesség"]
[167,"Trad167","Peso Totale","Celková hmotnost","总重量","Totalna težina","Poids total","総重量","Συνολικό βάρος","Total Weight","Kopējais svars","Waga całkowita","Peso total","Greutate totală","Общий вес","Celková hmotnosť","Skupna teža","Peso total","Totalvikt","Gesamtgewicht","Toplam ağırlık","Teljes súly"]
[168,"Trad168","Costo Gestione Ordine","Náklady na vyřízení objednávky","订单管理成本","Troškovi upravljanja narudžbom","Coût de traitement des commandes","注文管理コスト","Κόστος διαχείρισης παραγγελιών","Order managment cost","Pasūtījuma pārvaldības izmaksas","Koszt zarządzania zamówieniami","Custo de gestão de encomendas","Costul de gestionare a comenzii","Стоимость управления заказами","Náklady na správu objednávky","Stroški upravljanja naročila","Coste de gestión del pedido","Orderhanteringskostnad","Kosten der Auftragsabwicklung","Sipariş yönetimi maliyeti","Megrendelés kezelési költség"]
[169,"Trad169","Totale Prezzo Lordo","Celková prodejní cena","总价","Ukupna bruto cijena","Prix brut total","税込み総額","Συνολική ακκαθάριστη τιμή","Total Lord Price","Kopējā cena","Całkowita cena Lorda","Preço Total Bruto","Prețul total al Domnului","Общая цена лорда","Celková cena lorda","Skupna cena Gospoda","Precio bruto total","Totalt Lord -pris","Gesamtbruttopreis","Toplam Lord Fiyatı","Teljes ár"]
[170,"Trad170","Costo di trasporto","Náklady na dopravu","运输成本","Trošak dostave","Coût du transport","輸送費","Κόστος αποστολής","Shipping Cost","Piegādes izmaksas","Koszty wysyłki","Custo de envio","Costul de expediere","Стоимость доставки","Náklady na dopravu","Stroški pošiljanja","Coste del transporte","Fraktkostnad","Transportkosten","Nakliye maliyeti","Szállítási költség"]
[171,"Trad171","Prezzo Netto/ml","Nákupní cena/m","净价/米","Neto cijena/m","Prix net/ml","税抜き合計/ m","Καθαρή Τιμή/m","Net Price/m","Neto cena/m","Cena netto/m²","Preço líquido/m","Preț net/m","Цена нетто/м","Čistá cena/m","Neto cena/m","Precio neto/ml","Nettopris/m","Nettopreis/ml","Net Fiyat/m","Nettó ár/m"]
[172,"Trad172","Costo Materiale + trasporto e gestione","Náklady na materiál + doprava a manipulace","材料费+运费和管理费","Cijena materijala + dostava i upravljanje","Coût du matériel + transport et manutention","材料費+送料と手配","Κόστος υλικού + αποστολή και διαχείριση","Material cost + shipping and managment","Materiālu izmaksas + piegādes un pārvaldības izmaksas","Koszt materiałów + wysyłka i zarządzanie","Custo do material + envio e gestão","Costul materialelor + transport și gestionare","Стоимость материала + доставка и управление","Náklady na materiál + náklady na dopravu a správu","Stroški materiala + stroški pošiljanja in upravljanja","Coste del material + transporte y manipulación","Materialkostnad + frakt och hantering","Materialkosten + Transport und Handhabung","Malzeme maliyeti + nakliye ve yönetim","Anyagköltség + szállítási és kezelési költség"]
[173,"Trad173","Costo Materiale + altre spese/ml","Náklady na materiál + ostatní náklady/m","材料费+其他费用/m","Cijena materijala + ostali troškovi/m","Coût du matériel + autres dépenses/ml","材料費+その他の費用/ ml","Κόστος Υλικού + άλλα έξοδα/m","Material Cost + other costs/m","Materiālu izmaksas + citas izmaksas/m","Koszt materiału + inne koszty/m","Custo do material + outros custos/m","Costul materialelor + alte costuri/m","Стоимость материала + прочие затраты/м","Náklady na materiál + ostatné náklady/m","Stroški materiala + drugi stroški/m","Coste del material + otros gastos/ml","Materialkostnad + andra kostnader/m","Materialkosten + sonstige Kosten/ml","Malzeme Maliyeti + diğer maliyetler/m","Anyagköltség + egyéb költségek/m"]
[174,"Trad174","Kit Impermeabilizzazione","Hydroizolační sada","防水套装","Kit za hidroizolaciju","Kit d'imperméabilisation","防水キット","Σετ στεγανοποίησης","Waterproofing Kit","Hidroizolācijas komplekts","Zestaw hydroizolacyjny","Kit de impermeabilização","Kit de impermeabilizare","Гидроизоляционный комплект","Súprava na hydroizoláciu","Komplet za hidroizolacijo","Kit de impermeabilización","Vattentätningssats","Abdichtungs-Kit","Su Yalıtım Kiti","Vízszigetelő készlet"]
[175,"Trad175","% Cuneo spessore/montanti","%Vyrovnávací klíny sloupků","修整楔子","UČVRŠĆIVANJE KLINOM/USPRAVNO","Cale d'épaississement","% シミングウェッジ/直立","Γυαλιστερή σφήνα","% Shimming wedge/Uprights","Regulēšanas  ķīlis","Podkładki klinowe","Cunha","Cuier de calibrare","% регулировочный клин/стойки","Vyrovnávací klin","Ključ za premikanje","Cuña espesor/montante","Skimrande kil","Verdickungskeil","Şimşek kaması","Simító ék"]
[176,"Trad176","Distanza Extra","Vzdálenost navíc","额外距离","Dodatna udaljenost","Distance supplémentaire","余分の距離","Επιπλέον απόσταση","Extra distance","Papildu attālums","Dodatkowa odległość","Distância extra","Distanța suplimentară","Дополнительное расстояние","Dodatočná vzdialenosť","Dodatna razdalja","Distancia extra","Extra distans","Extra Abstand","Ekstra mesafe","Extra távolság"]
[177,"Trad177","Tipo Base Verticale","Vertikální typ základny","垂直底座类型","Okomita vrsta baze","Type de base Vertical","バーティカルベースタイプ","Τύπος κάθετης βάσης","Vertical Base Type","Vertikālās pamatnes tips","Pionowy typ podstawy","Tipo de Base Vertical","Tip de bază verticală","Вертикальный базовый тип","Typ vertikálnej základne","Vertikalni podstavek","Tipo de base vertical","Vertikal bastyp","Sockel Typ Vertikal","Dikey Taban Tipi","Függőleges alap típusa"]
[178,"Trad178","Dati Progetti","Údaje o projektu","项目数据","Podaci o projektu","Données du projet","プロジェクトデータ","Δεδομένα έργου","Project Data","Projekta dati","Dane projektu","Dados do projecto","Date despre proiect","Данные проекта","Podatki o projektu","Údaje o projekte","Datos del proyecto","Uppgifter om projektet","Projektdaten","Proje Verileri","Projekt adatok"]
[179,"Trad179","Versione Plastica","Plastová verze","塑料版","Plastična verzija","Version en plastique","プラスチックバージョン","Πλαστική έκδοση","Plastic version","Plastmasas versija","Wersja plastikowa","Versão plástica","Versiunea din plastic","Пластиковая версия","Plastična različica","Plastová verzia","Versión de plástico","Plastversion","Kunststoffausführung","Plastik versiyon","Műanyag változat"]
[180,"Trad180","Cartaceo","Papír","纸张","Papir","Papier","紙","Χαρτί","Paper","Papīrs","Papier","Papel","Hârtie","Бумага","Papir","Papier","Papel","Papper","Papier","Kağıt","Papír"]
[181,"Trad181","Online","Online","在线","Online","En ligne","オンライン","Online","Online","Tiešsaistē","Online","Online","Online","онлайн","Spletna stran","Online","En línea","Online","Online","İnternet üzerinden","Online"]
[182,"Trad182","Manuale","Manuální","手册","Priručnik","Manuel","マニュアル","Χειροκίνητο","Manual","Rokasgrāmata","Podręcznik","Manual","Manual","Руководство","Priročnik","Manuálne","Manual","Manuell","Handbuch","Manuel","Útmutató"]
[183,"Trad183","da spedire","které mají být odeslány","待发送","poslati","à envoyer","送信する","να αποσταλεί","to be sent","jānosūta","do wysłania","a enviar","să fie trimisă","быть отправленным","ki jih je treba poslati","ktoré sa majú odoslať","que se enviará","som ska skickas.","zu versenden","gönderilecek","elküldendő"]
[184,"Trad184","Interasse greche pannello","Rozpětí boku panelu","板间距","Razmak između ploča","Découpage des panneaux","サンドイッチパネル山間隔","Απόσταση πάνελ","Panel hips span","paneļu atstatums","Grecki odstęp między panelami","Espaçamento da onda do painel","Spațierea dintre panouri grecești","Размах бедер панели","Panel bokov rozpätie","Panel razpon bokov","Envergadura de las caderas del panel","Panel höfter spänna","Sickenabstand","Panel kalça açıklığı","Panel csípőfesz"]
[185,"Trad185","Fissaggi Inclusi","Včetně upevňovacích prvků","包括固定装置","Pričvršćivači uključeni","Fixations incluses","締結具同梱","Περιλαμβάνονται εξαρτήματα","Fixings included","Iekļauti stiprinājumi","W zestawie mocowania","Fixações incluídas","Fixări incluse","Крепления включены","Upevňovacie prvky v cene","Pritrdilni elementi vključeni","Fijaciones incluidas","Fästen ingår","Befestigungsmaterial enthalten","Sabitleme dahil","Rögzítések mellékelve"]
[186,"Trad186","Rondella in EPDM","Podložka z EPDM","三元乙丙垫圈","EPDM podloška","Rondelle en EPDM","EPDMワッシャー","Ροδέλα EPDM","EPDM washer","EPDM paplāksne","Podkładka EPDM","Anilha de EPDM","masina de spalat EPDM","Шайба из ЭПДМ","EPDM podložka","EPDM podložka","Arandela EPDM","EPDM bricka","EPDM-Unterlegscheibe","EPDM yıkayıcı","EPDM alátét"]
[187,"Trad187","TIPO DI CHIUSURA","TYP ZÁMKU","锁类型","VRSTA ZATVARANJA","TYPE DE SERRURE","鍵タイプ","ΤΥΠΟΣ ΚΛΕΙΣΜΑΤΟΣ","TYPE OF LOCK","SLĒGŠANAS VEIDS","RODZAJ ZAMKNIĘCIA","TIPO DE FECHO","TIP DE ÎNCHIDERE","ТИП ЗАМКА","TYP ZÁMKU","VRSTA KLJUČAVNICE","TIPO DE CERRADURA","TYP AV LÅS","SCHLOSSTYP","KİLİT TÜRÜ","ZÁRTÍPUS"]
[188,"Trad188","PORTA DI CHIUSURA","ZAMYKÁNÍ DVEŘÍ","关门","VRATA KOJA SE ZATVARAJU","PORTE VERROUILLÉE","ドアを閉める","ΠΟΡΤΑ ΠΟΥ ΚΛΕΙΝΕΙ","LOCKING DOOR","AIZSLĒGŠANAS DURVIS","ZAMYKANIE DRZWI","PORTA DE SEGURANÇA","ÎNCHIDERE UȘĂ","ЗАПИРАНИЕ ДВЕРИ","ZAMYKANIE DVERÍ","ZAKLEPNA VRATA","PUERTA DE BLOQUEO","LÅSAR DÖRREN","abschließbare Tür","KİLİTLİ KAPI","ZÁRÓ AJTÓ"]
[189,"Trad189","SCALA SGANCIABILE","ODNÍMATELNÝ ŽEBŘÍK","可拆卸梯子","ODJELJIVE LJESTVE","ÉCHELLE AMOVIBLE","取外し可能な梯子","ΑΦΑΙΡΟΥΜΕΝΗ ΣΚΑΛΑ","DETACHABLE LADDER","NOŅEMAMAS KĀPNES","ZDEJMOWANA DRABINA","ESCADA DESTACÁVEL","SCARA DETASABILE","СЪЕМНАЯ ЛЕСТНИЦА","ODNÍMATEĽNÝ REBRÍK","LOHLJIVA LESTVA","ESCALERA DESMONTABLE","AVTAGBAR STEGE","ABNEHMBARE LEITER","SÖKÜLEBİLİR MERDİVEN","LESZERELHETŐ LÉTRA"]
[190,"Trad190","Parallela alle greche","Rovnoběžně s boky","与板平行","Paralelno s bokovima","Parallèle aux lames","サンドイッチパネル山線と平行","Παράλληλη με την ελληνική","Parallel to hips","Paralēli","Równolegle do greckiego","Paralelo à onda","Paralel cu grecul","Параллельно бедрам","Paralelne s bokmi","Vzporedno s boki","Paralelo a las caderas","Parallellt med höfter","parallel zur Sicke","Kalçalara paralel","Élszarufára párhuzamos"]
[191,"Trad191","Perpendicolare alle greche","Kolmo k bokům","垂直于板","Okomito na bokove","Perpendiculaire aux volets","サンドイッチパネル山線に垂直","Κάθετα στην ελληνική","Perpendicular to hips","Perpendikulāri","Prostopadle do greki","Perpendicular à onda","Perpendicular pe greacă","Перпендикулярно бедрам","Kolmo na boky","Pravokotno na boke","Perpendicular a las caderas","Vinkelrätt mot höfterna","senkrecht zur Sicke","kalçalara dik","Élszarufára merőleges"]
[192,"Trad192","SISTEMA DI RIPOSO","ODPOČÍVACÍ SYSTÉM","支撑系统","SUSTAV ZA ODMOR","SYSTÈME DE REPOS","休息システム","ΣΥΣΤΗΜΑ ΑΝΑΠΑΥΣΗΣ","RESTING SYSTEM","ATPŪTAS SISTĒMA","SYSTEM WYPOCZYNKU","SISTEMA DE REPOUSO","SISTEM DE ODIHNA","СИСТЕМА ОТДЫХА","ODPOČINOVÝ SYSTÉM","SISTEM POČIVANJA","SISTEMA DE DESCANSO","VILOSYSTEM","RUHESYSTEM","DİNLENME SİSTEMİ","PIHENŐ RENDSZER"]
[193,"Trad193","MODULO DI SDOPPIAMENTO","ROZDĚLOVACÍ MODUL","分裂模块","DIJELJIVI MODUL","MODULE DE FRACTIONNEMENT","分割モジュール","ΑΠΟΣΠΩΜΕΝΗ ΕΚΔΟΣΗ","SPLITTING MODULE","IZLAIDINĀŠANAS MODULIS","MODUŁ WYDANIA","MÓDULO DE DESENGANCHO","MODUL DE LANSAREA","РАЗДЕЛИТЕЛЬНЫЙ МОДУЛЬ","ŠTIEPACÍ MODUL","MODUL ZA DELITEV","MÓDULO DE DIVISIÓN","DELNINGSMODUL","SPALTMODUL","AYIRMA MODÜLÜ","OSZTÓ MODUL"]
[194,{"$f":"+_xlfn.CONCAT(\"Trad\",A194)","v":"Trad194"},"DESTRA","PRAVÁ","右边","DESNO","DROIT","右","ΔΕΞΙΑ","RIGHT","PA LABI","PRAWIDŁOWY","DIREITA","DREAPTA","ПРАВИЛЬНО","SPRÁVNY","PRAV","DERECHO","HÖGER","RECHTS","SAĞ","JOBB"]
[195,"Trad195","SINISTRA","LEVÝ","左边","LIJEVO","GAUCHE","左","ΑΡΙΣΤΕΡΑ","LEFT","PA kreisi","LEWO","ESQUERDA","STÂNGA","ЛЕВЫЙ","LEFT","LEVO","IZQUIERDA","VÄNSTER","LINKS","AYRILDI","BAL"]
[196,"Trad196","DIREZIONE PRIMO SDOPPIAMENTO","SMĚR PRVNÍHO DĚLENÍ","优先分割方向","PRAVAC PRVOG DIJELJENJA","DIRECTION DU PREMIER FRACTIONNEMENT","第一分割ディレクション","ΚΑΤΕΥΘΥΝΣΗ ΠΡΟΣ ΠΡΩΤΟ ΔΙΑΧΩΡΙΣΜΟ","DIRECTION OF FIRST SPLITTING","VIRZIENS ","PIERWSZY SPLIT KIERUNKU","DIREÇÃO DA PRIMEIRA DIVISÃO","DIRECȚIA PRIMUL SPLIT","НАПРАВЛЕНИЕ ПЕРВОЙ РАСКОЛКИ","SMER PRVÉHO DELENIA","SMER PRVE DELITVE","DIRECCIÓN antes de división","RIKTNING FÖR FÖRSTA DELNING","RICHTUNG DER ERSTEN SPALTUNG","İLK AYIRMA YÖNÜ","AZ ELSŐ OSZTÁS IRÁNYA"]
[197,"Trad197","PRIMO MODULO REMOVIBILE","PRVNÍ VYJÍMATELNÝ MODUL","第一个可拆卸模块","PRVI MODUL koji se može ukloniti","PREMIER MODULE AMOVIBLE","最初の取外し可能モジュール","ΠΡΩΤΗ ΑΦΑΙΡΟΥΜΕΝΗ ΜΟΝΑΔΑ","FIRST REMOVABLE MODULE","PIRMAIS NOŅEMAMAIS MODULIS","PIERWSZY WYJMOWANY MODUŁ","PRIMEIRO MÓDULO REMOVÍVEL","PRIMUL MODUL DETASAL","ПЕРВЫЙ СЪЕМНЫЙ МОДУЛЬ","PRVÝ ODNÍMATEĽNÝ MODUL","PRVI ODSTRANLJIV MODUL","PRIMER MÓDULO DESMONTABLE","FÖRSTA AVTAGNINGSBAR MODUL","erstes Modul abnehmbar","İLK ÇIKARILABİLİR MODÜL","ELSŐ KISZERELHETŐ MODUL"]
[198,"Trad198","TIPO VERSIONE ACCIAIO","TYP PROVEDENÍ OCELI","型钢版","TIP ČELIČNA VERZIJA","TYPE VERSION ACIER","スティールバージョン","ΕΚΔΟΣΗ ΑΠΟ ΑΤΣΑΛΙ","TYPE VERSION STEEL","TIPA TĒRAUDA VERSIJA","TYP WERSJA STALOWA","TIPO VERSÃO EM AÇO","TIP VERSIUNE STEEL","ТИП ВЕРСИЯ СТАЛЬ","TYPOVÉ PREVEDENIE OCEL","VRSTA VERZIJA JEKLO","TIPO VERSIÓN ACERO","TYP VERSION STÅL","TYPENAUSFÜHRUNG STAHL","TİP VERSİYON ÇELİK","ACÉL TÍPUSÚ VÁLTOZAT"]
[199,"Trad199","ACCIAIO INOX A2","NEREZOVÁ OCEL A2","不锈钢 A2","INOX A2","ACIER INOXYDABLE A2","ステンレス鋼A2","ΑΝΟΞΕΙΔΩΤΟ Α2","STAINLESS STEEL A2","NErūsējošais tērauds A2","STAL NIERDZEWNA A2","AÇO INOX A2","OȚEL INOX A2","НЕРЖАВЕЮЩАЯ СТАЛЬ A2","NEREZ A2","NErjaveče jeklo A2","ACERO INOXIDABLE A2","ROSTFRITT STÅL A2","EDELSTAHL A2","PASLANMAZ ÇELİK A2","ROZSDAMENTES ACÉL A2"]
[200,"Trad200","ACCIAIO INOX A4","NEREZOVÁ OCEL A4","不锈钢 A4","INOX A4","ACIER INOXYDABLE A4","ステンレス鋼A4","ΑΝΟΞΕΙΔΩΤΟ Α4","STAINLESS STEEL A4","Nerūsējošais Tērauds A4","STAL NIERDZEWNA A4","AÇO INOX A4","OȚEL INOX A4","НЕРЖАВЕЮЩАЯ СТАЛЬ А4","NEREZ A4","INOX A4","ACERO INOXIDABLE A4","ROSTFRITT STÅL A4","EDELSTAHL A4","PASLANMAZ ÇELİK A4","ROZSDAMENTES ACÉL A4"]
[201,"Trad201","RIMOVIBILE","ODNÍMATELNÝ","可拆卸的","ZAMJENJIV","REMOVABLE","取外し可能","ΑΦΑΙΡΟΥΜΕΝΟ","REMOVABLE","NOŅEMAMA","USUWANY","REMOVÍVEL","AMOVIBIL","СЪЕМНЫЙ","ODNÍMATEĽNÝ","ODSTRANLJIV","desmontable","AVTAGBAR","ABNEHMBARE","ÇIKARILABİLİR","KISZERELHETŐ"]
[202,"Trad202","FISSO","UPEVNĚNO","固定的","FIKSNO","FIXE","固定","ΣΤΑΘΕΡΟΣ","FIXED","FIXED","NAPRAWIONY","FIXO","FIX","ФИКСИРОВАННЫЙ","OPRAVENÉ","FIKSNO","REPARADO","FAST","FEST","SABİT","RÖGZÍTETT"]
[203,"Trad203","INTERMEDIO PASSANTE","PŘES PROSTŘEDEK","中间贯穿","SREDNJE KROZ","INTERMÉDIAIRE PAR","通貨できる中間","ΕΝΔΙΑΜΕΣΟ ΜΕΣΩ","INTERMEDIATE THROUGH","Vidusspunkts","POŚREDNI PRZEZ","INTERMÉDIO PASSANTE","INTERMEDIAR PRIN","ПРОМЕЖУТОЧНЫЙ ЧЕРЕЗ","MEDZI PROSTREDNÍCTVOM","Vmesno SKOZI","INTERMEDIO pasante","MELLAN TILL","ZWISCHEN DURCH","ORTA DÜZEY","KÖZÉP ÁT"]
[204,"Trad204","ALTEZZA NON SUFFICIENTE","VÝŠKA NENÍ DOSTATEČNÁ","高度不够","NEDOVOLJNA VISINA","HAUTEUR INSUFFISANTE","十分な高さではない","ΑΝΕΠΑΡΚΕΣ ΥΨΟΣ","INSUFFICIENT HEIGHT","NEPIETIEKAMS AUGSTUMS","NIEWYSTARCZAJĄCA WYSOKOŚĆ","ALTURA NÃO SUFICIENTE","INALTIME NU SUFICIENTA","НЕДОСТАТОЧНАЯ ВЫСОТА","NEDOSTATOČNÁ VÝŠKA","NEDOSTOJNA VIŠINA","ALTURA INSUFICIENTE","Otillräcklig höjd","UNZUREICHENDE HÖHE","YETERSİZ YÜKSEKLİK","ELÉGTELEN MAGASSÁG"]
[205,"Trad205","DETTAGLI","PODROBNOSTI","细节","DETALJI","DÉTAILS","詳細","ΛΕΠΤΟΜΕΡΙΕΣ","DETAILS","INFORMĀCIJAS","DETALE","DETALHES","DETALII","ДЕТАЛИ","PODROBNOSTI","PODROBNOSTI","DETALLES","DETALJER","Details","DETAYLAR","RÉSZLETEK"]
[206,"Trad206","CON PROTEZIONE","S OCHRANOU","带保护","SA ZAŠTITOM","AVEC PROTECTION","保護付き","ΜΕ ΠΡΟΣΤΑΣΙΑ","WITH PROTECTION","AR AIZSARDZĪBU","Z OCHRONĄ","COM PROTEÇÃO","CU PROTECTIE","С ЗАЩИТОЙ","S OCHRANOU","Z ZAŠČITO","CON PROTECCIÓN","MED SKYDD","MIT SCHUTZ","KORUMA İLE","VÉDELEMMEL"]
[207,"Trad207","Attenzione: senza estensione finale","Pozor: bez konečného prodloužení","注意：没有终端延长件","Pažnja: bez završnog proširenja","Attention : sans extension finale","注意：最終エクステンションなし","Προσοχή: χωρίς τελική παράταση","Attention: without final extension","Uzmanību: bez galīgā pagarinājuma","Uwaga: bez końcowego przedłużenia","Atenção: sem extensão final","Atentie: fara prelungire finala","Внимание: без окончательного расширения","Pozor: bez konečného predĺženia","Pozor: brez končnega podaljšanja","Atención: sin extensión final","OBS: utan slutlig förlängning","Achtung: ohne Endverlängerung","Dikkat: son uzatma olmadan","Figyelem: végső kiterjesztés nélkül"]
[208,"Trad208","TRATTO FINALE","Závěrečná úsek","最后一节","Završni dio","Dernière ligne droite","最終セクション","Τελικό Τμήμα","Final stretch","Noslēguma sadaļa","Sekcja końcowa","Seção Final","Secțiunea finală","Финальная растяжка","Záverečný úsek","Končni razteg","tramo final","Sista sträckan","Endstück","son esneme","Utolsó nyújtás"]
[209,"Trad209","ULTIMO SDOPPIAMENTO","Poslední rozdělení","最后拆分","Posljednje razdvajanje","Dernier fractionnement","最後の分割","Τελευταίος διαχωρισμός","Last split","Pēdējā sadalīšana","Ostatni podział","Última divisão","Ultima despicare","Последний сплит","Posledné rozdelenie","Zadnji delitev","última división","Senaste split","Letzte Trennung","Son bölünme","Utolsó felosztás"]
[210,"Trad210","TRATTI INTERMEDI","Střední část","中间部分","Srednji dio","Section intermédiaire","中級セクション","Ενδιάμεσο τμήμα","Intermediate Section","Starpposma sadaļa","Sekcja środkowa","Seção intermediária","Sectiunea intermediara","Промежуточная секция","Stredná sekcia","Vmesni odsek","Tramo Intermedio","Mellansektion","Zwischenabschnitt","Ara Bölüm","Köztes szakasz"]
[211,"Trad211","SDOPPIAMENTI INTERMEDI","Mezilehlé rozdělení","中间拆分","Srednje dijeljenje","Fractionnement intermédiaire","中間分割","Ενδιάμεσοι διαχωριστες","Intermediate splitting","Starpposma sadalīšanās","Pośrednie podziały","Divisões intermediárias","Despărțiri intermediare","Промежуточное расщепление","Stredné delenie","Vmesna cepitev","división intermedia","Mellansplittring","Zwischenspaltung","ara bölme","Köztes osztás"]
[212,"Trad212","TRATTO INIZIALE","Úvodní část","起始段","Početna sekcija","Section initiale","初期ストレッチ","Αρχικό τέντωμα","Initial section","sākotnējā sadaļa","Rozciąganie początkowe","Alongamento inicial","Întindere inițială","Начальный раздел","Úvodná sekcia","Začetni odsek","Tramo inicial","Inledande avsnitt","Anfangsabschnitt","İlk bölüm","Kezdeti szakasz"]
[213,"Trad213","Opzione Base","Volitelná základna","基本选项","Osnovna opcija","Option de base","基本オプション","Βασική επιλογή","Option de base","Pamata variants","Opcja podstawowa","Opção básica","Opțiune de bază","Базовый вариант","Základná možnosť","Možnost osnove","Opción de base","Option de base","Auswahl der Grundpatte","Temel seçenek","Alap opció"]
[214,"Trad214","ALTEZZA DA PIANO DI SBARCO","Výška od země","着陆高度","Visina podesta","Hauteur d'atterrissage","着陸高さ","Ύψος προσγείωσης","Landing Height","Nosēšanās augstums","Wysokość lądowania","Altura de aterragem","Înălțimea de aterizare","Высота посадки","Výška pristátia","Višina pristanka","Altura de desenbarque","Landningshöjd","Landehöhe","İniş Yüksekliği","Érkezési magasság"]
[215,"Trad215","Dati Progetto Insufficienti!!!","Údaje o projektu Nedostatečné!!!","项目资料不足！！！","Nedovoljni podaci u projektu !!!","Données de projet insuffisantes !!!","不十分なプロジェクトデータ!!!","Ανεπαρκή δεδομένα έργου !!!","Insufficient Project Data!!!","Nepietiekami projekta dati !!!","Niewystarczające dane projektu !!!","Dados de projeto insuficientes !!!","Date insuficiente ale proiectului!!!","Недостаточно данных проекта!!!","Nedostatočné údaje o projekte!!!","Nezadostni podatki o projektu !!!","Datos de proyecto insuficientes !!!","Otillräckliga projektdata !!!","Unzureichende Projektdaten !!!","Yetersiz Proje Verisi !!!","Nincs elegendő projektadat!!!"]
[216,"Trad216","Spessore Isolamento","Tloušťka izolace","保温厚度","Debljina izolacije","Épaisseur Isolation","断熱材の厚さ","Πάχος μόνωσης","Thickness of Insulation","Izolācijas biezums","Grubość izolacji","Espessura do isolamento","Grosimea izolației","Толщина изоляции","Hrúbka izolácie","Debelina izolacije","Espesor del aislamiento","Tjocklek på isolering","Dicke der Isolierung","Yalıtım Kalınlığı","Szigetelés vastagsága"]
[217,"Trad217","CANCELLA TUTTO","VŠE SMAZAT","删除全部","IZBRIŠI SVE","SUPPRIMER TOUT","すべてを消去する","ΣΒΗΣΤΕ ΤΑ ΠΑΝΤΑ","DELETE ALL","DZĒST VISU","WYMAZAC WSZYSTKO","APAGUE TUDO","ȘTERGE TOTUL","УДАЛИТЬ ВСЕ","VYMAZAŤ VŠETKO","IZBRIŠI VSE","ELIMINAR TODO","RADERA ALLT","ALLES LÖSCHEN","HEPSİNİ SİL","MINDET TÖRÖLNI"]
[218,"Trad218","LA VALUTA DELLA FATTURA E' IN","MĚNA FAKTURY JE V","发票的货币为","VALUTA FAKTURE JE u","LA DEVISE DE LA FACTURE EST EN","請求書の通貨は","ΤΟ ΝΟΜΙΣΜΑ ΤΟΥ ΤΙΜΟΛΟΓΙΟΥ ΕΙΝΑΙ ΣΕ","INVOICE CURRENCY IS IN","RĒĶINA VALŪTA IR Ievadīta","WALUTA FAKTURY JEST W","A MOEDA DA FATURA ESTÁ EM","MONEDA FACTURII ESTE IN","ВАЛЮТА СЧЕТА В","MENA FAKTÚRY JE IN","VALUTA RAČUNA JE V","LA MONEDA DE LA FACTURA ES EN","FAKTURA VALUTA ÄR I","RECHNUNGSWÄHRUNG IST IN","FATURA PARA BİRİMİ VAR","A SZÁMLA PÉNZNEME"]
[219,"Trad219","LA VALUTA LOCALE E' SOLO INDICATIVA","MÍSTNÍ MĚNA JE POUZE ORIENTAČNÍ","当地货币仅供参考","LOKALNA VALUTA JE SAMO INDIKATIVNA","MONNAIE LOCALE À TITRE INDICATIF","現地通貨は指標のみです","ΤΟ ΤΟΠΙΚΟ ΝΟΜΙΣΜΑ ΕΙΝΑΙ ΜΟΝΟ ΕΝΔΕΙΚΤΙΚΟ","LOCAL CURRENCY IS INDICATIVE ONLY","VIETĒJĀ VALŪTA IR TIKAI INDIKATĪVA","WALUTA LOKALNA JEST WYŁĄCZNIE ORIENTACYJNA","A MOEDA LOCAL É APENAS INDICATIVO","MONEDA LOCALĂ ESTE NUMAI INDICATIVA","МЕСТНАЯ ВАЛЮТА УКАЗАНА ТОЛЬКО ПРИМЕРНО","MIESTNA MENA JE LEN ORIENTAČNÁ","LOKALNA VALUTA JE SAMO OKVIRNA","LA MONEDA LOCAL ES SÓLO INDICATIVA","LOKAL VALUTA ÄR ENDAST VÄGLEDANDE","DIE LOKALE WÄHRUNG IST NUR INDIKATIV","YEREL PARA BİRİMİ YALNIZCA GÖSTERGEDİR","A HELYI PÉNZNEM CSAK INDIKATÍV"]
[220,"Trad220","SISTEMI ANTICADUTA","SYSTÉMY ZACHYCENÍ PÁDU","防坠落系统","SUSTAVI ZA ZAŠTITU OD PADA","SYSTÈMES ANTICHUTE","落下保護システム","ΣΥΣΤΗΜΑΤΑ ΠΡΟΣΤΑΣΙΑΣ ΠΤΩΣΗΣ","FALL ARREST SYSTEMS","Pretkritiena SISTĒMAS","SYSTEMY OCHRONY PRZED UPADKIEM","SISTEMAS DE PROTEÇÃO ANTI-QUEDA","SISTEME DE PROTECȚIE LA CADERE","СИСТЕМЫ ЗАЩИТЫ ОТ ПАДЕНИЯ","SYSTÉMY ZASTAVENIA PÁDU","SISTEMI ZA ZAPOR","SISTEMAS anticaída","FALLARRETSSYSTEM","ABSTURZSICHERUNGSSYSTEME","DÜŞME TUTMA SİSTEMLERİ","Leesésgátló RENDSZEREK"]
[221,"Trad221","LINEE VITA E SISTEMA BINARIO","LANKOVÉ A KOLEJNICOVÉ SYSTÉMY","生命线和轨道系统","LINIJE ŽIVOTA I SUSTAV TRAČNICA","LES LIGNES DE VIE ET LES SYSTÈMES FERROVIAIRES","ライフラインとバイナリシステム","ΓΡΑΜΜΕΣ ΖΩΗΣ ΚΑΙ ΣΥΣΤΗΜΑΤΑ RAIL","LIFELINES AND RAIL SYSTEMS","Drošības  LĪNIJAS UN sliežu SISTĒMA","LINIE ŻYCIA I SYSTEM BINARNY","LINHAS DE VIDA E SISTEMA BINÁRIO","LINII DE VIAȚĂ ȘI SISTEM BINAR","СПАСАТЕЛЬНЫЕ ЛИНИИ И ЖЕЛЕЗНОДОРОЖНЫЕ СИСТЕМЫ","ŽIVOTNÉ VEDENIA A KOĽAJNICOVÉ SYSTÉMY","LIFELINES IN ŽELEZNIŠKI SISTEMI","LÍNEAS DE VIDA Y sitema binariro","LIVSLINJER OCH JÄRNVÄNDSSYSTEM","LEBENSLINIEN UND SCHIENENSYSTEME","YAŞAM HATLARI VE RAYLI SİSTEMLER","KÁBELES ÉS SÍNES RENDSZEREK"]
[222,"Trad222","PUNTI SINGOLI ","JEDNOTLIVÉ BODY ","单锚点","POJEDINAČNE TOČKE ","POINTS SIMPLES ","シングルポイント","MΟΝΑ ΣΗΜΕΙΑ ΑΓΚΥΡΩΣΗΣ","SINGLE POINTS ","ATSEVIŠĶI PUNKTI","POJEDYNCZE PUNKTY","PONTOS DE ANCORAMENTO","PUNCTE SINGLE","ОТДЕЛЬНЫЕ ПУНКТЫ","JEDINÉ BODY","POSAMEZNE TOČKE","PUNTOS únicos","ENKLA POÄNG","Einzelanschlagspunkte","TEK PUAN","EGYSZERŰ KIKÖTÉSI PONT"]
[223,"Trad223","SUPPORTI E ACCESSORI","DRŽÁKY A PŘÍSLUŠENSTVÍ","支架和配件","NOSAČI I DODATNA OPREMA","SUPPORTS ET ACCESSOIRES","サポートとアクセサリー","ΣΤΗΡΙΞΕΙΣ ΚΑΙ ΑΞΕΣΟΥΑΡ","BRACKETS AND ACCESSORIES","BALSTI UN PIEDERUMI","WSPORNIKI I AKCESORIA","SUPORTES E ACESSÓRIOS","SUPORTURI SI ACCESORII","КРОНШТЕЙНЫ И ПРИНАДЛЕЖНОСТИ","KONZOLY A PRÍSLUŠENSTVO","NOSILA IN DODATKI","SOPORTES Y ACCESORIOS","FÄSTEN OCH TILLBEHÖR","HALTERUNGEN UND ZUBEHÖR","BRAKETLER VE AKSESUARLAR","TARTOZÉKOK ÉS FELFOGATÓK"]
[224,"Trad224","Singolo articolo","Jednotlivá položka","单篇","Jedan artikl","Article unique","単一の記事","ΜΟΝΟ ΠΡΟΙΟΝ","Single article","Viens raksts","Pojedynczy artykuł","Artigo único","Un singur articol","Отдельная статья","Jediný článok","En sam članek","Articulo úNICO","Enstaka artikel","Einzelner Artikel","Tek makale","Egy darab"]
[225,"Trad225","Gruppo prodotto","Skupina výrobků","产品组","Grupa proizvoda","Groupe de produits","製品グループ","Ομάδα προϊόντων","Product group","Produktu grupa","Grupa produktów","Grupo de produtos","Grup de produse","Группа товаров","Skupina produktov","Skupina izdelkov","Grupo de productos","Produktgrupp","Produktgruppe","Ürün grubu","Termékcsoport"]
[226,"Trad226","Condizioni di pagamento","Platební podmínky","付款条件","Uvijeti plaćanja","Conditions de paiement","支払条件","Οροι πληρωμής","Payment conditions","Maksājuma nosacījumi","Warunki płatności","Termos de pagamento","Termeni de plata","Условия оплаты","Platobné podmienky","Pogoji plačila","Condiciones de pago","Villkor för betalning","Zahlungsbedingungen","Ödeme koşulları","Fizetési feltételek"]
[227,"Trad227","Firma TS","Podpis TS","技术销售签名","TS potpis","Signature TS","TS署名","Υπογραφή TS","TS signature","TS paraksts","Podpis TS","Assinatura TS","Semnătura TS","подпись ТС","podpis TS","TS podpis","firma TS","TS signatur","Unterschrift des Mitarbeiters","TS imzası","TS aláírás"]
[228,"Trad228","Firma ASM","Podpis ASM","区域经理签名","ASM potpis","Signature ASM","ASM署名","Υπογραφή ASM","ASM signature","ASM paraksts","Podpis ASM","Assinatura ASM","Semnătura ASM","подпись ASM","podpis ASM","ASM podpis","firma ASM","ASM signatur","ASM-Signatur","ASM imzası","ASM aláírás"]
[229,"Trad229","Firma Cliente","Podpis zákazníka","客户签名","Potpis klijenta","Signature du client","お客様の署名","Υπογραφή πελάτη","Customer Signature","Klienta paraksts","Podpis klienta","Assinatura do cliente","Semnătura clientului","Подпись покупателя","Podpis zákazníka","Podpis stranke","Firma del cliente","Kundsignatur","Unterschrift des Kunden","Müşteri imzası","Ügyfél aláírása"]
[230,"Trad230","Compila il campo nel foglio CRM","Vyplňte pole v listu CRM","填写 CRM 表中的字段","Popunite polje u CRM listu","Remplissez le champ dans la feuille CRM","CRMシートのフィールドに入力します","Συμπληρώστε το πεδίο στο φύλλο CRM","Fill in the field in the CRM sheet","Aizpildiet CRM lapas lauku","Wypełnij pole w arkuszu CRM","Preencha o campo na folha CRM","Completați câmpul din foaia CRM","Заполните поле в CRM-листе","Vyplňte pole v hárku CRM","Izpolnite polje v CRM listu","Complete el campo en la hoja de CRM","Fyll i fältet i CRM-bladet","Füllen Sie das Feld im CRM aus","CRM sayfasındaki alanı doldurun","Töltse ki a mezőt a CRM lapon"]
[231,"Trad231","FISSAGGI","UPEVNĚNÍ","固定装置","pričvršćivanje","FIXATIONS","固定具","ΣΤΕΡΕΩΣΕΙΣ","FIXINGS","STIPRINĀJUMI","MOCOWANIA","FIXAÇÕES","FIXARE","КРЕПЛЕНИЯ","Upevnenia","PRITRDILA","FIJACIONES","FÄSTNINGAR","BEFESTIGUNGEN","DÜZENLEMELER","KÖTŐELEMEK"]
[232,"Trad232","SISTEMI DI FISSAGGIO","UPEVŇOVACÍ SYSTÉMY","固定系统","SUSTAVI ZA PRIČVRŠĆIVANJE","SYSTEMES DE FIXATION","固定システム","ΣΥΣΤΗΜΑΤΑ ΣΤΕΡΕΩΣΗΣ","FIXING SYSTEMS","Stiprinājumu SISTĒMAS","SYSTEMY MOCOWANIA","SISTEMAS DE FIXAÇÃO","SISTEME DE FIXARE","КРЕПЕЖНЫЕ СИСТЕМЫ","UPEVŇOVACIE SYSTÉMY","FIKSNI SISTEMI","SISTEMAS DE FIJACIÓN","FÄSTSYSTEM","BEFESTIGUNGSSYSTEME","SABİTLEME SİSTEMLERİ","RÖGZÍTŐ RENDSZEREK"]
[233,"Trad233","TENUTA ALL'ARIA E IMPERMEABILIZZAZIONE","VZDUCHOTĚSNOST A VODOTĚSNOST","气密性和防水性","ZRAKOTIJESNOST I HIDROIZOLACIJA","ÉTANCHÉITÉ À L'AIR ET À L'EAU","気密性と防水性","ΣΤΕΓΑΝΟΤΗΤΑ ΚΑΙ ΣΤΕΓΑΝΩΣΗ","AIRTIGHTNESS AND WATERPROOFING"," HIDROIZOLCIJA un blīvums","SZCZELNOŚĆ I WODOODPORNOŚĆ","ESTANQUIDADE AO AR E IMPERMEABILIZAÇÃO","ETANCHEITATEA ȘI IMPERMEABILIZARE","ГЕРМЕТИЧНОСТЬ И ГИДРОИЗОЛЯЦИЯ","VZDUCHOTESNOSŤ A HYDROIZOLÁCIA","ZRAKOTESNOST IN HITROTESNOST","ESTANQUEIDAD E IMPERMEABILIDAD","LUFTTÄTHET OCH VATTENTÄTNING","LUFTDICHTIGKEIT UND BAUABDICHTUNG","HAVA GEÇİRMEZLİK VE SU YALITIM","LÉGZÁRSÁG ÉS VÍZSZIGETELÉS"]
[234,"Trad234","MEMBRANE E FRENI AL VAPORE, NASTRI, ACCESSORI","PAROZÁBRAMY, MEMBRÁNY A PAROBRZDY, PÁSKY, PŘÍSLUŠENSTVÍ","隔气膜，胶带和配件","PARNE BRANE, TRAKE, PRIBOR","MEMBRANES PAR VAPEUR ET FREINS, RUBANS, ACCESSOIRES","蒸気膜とブレーキ、テープ、アクセサリー","ΦΡΕΝΑ ΥΔΡΑΤΜΩΝ ΚΑΙ ΦΡΑΓΜΟΙ","VAPOR MEMBRANES AND BARRIERS, TAPES, ACCESSORIES","TVAIKA MEMBRANAS UN barjeras, LENTES, PIEDERUMI","MEMBRANY I HAMULCE PAROWE, TAŚMY, AKCESORIA","MEMBRANAS DE CONTROLO DE VAPOR, FITAS, ACESSÓRIOS","MEMBRANE DE VAPORI SI FRANE, BANDI, ACCESORII","ПАРОМЕМБРАНЫ И БАРЬЕРЫ, ЛЕНТЫ, ПРИНАДЛЕЖНОСТИ","PARNÉ MEMBRÁNY A BARIÉRY, PÁSKY, PRÍSLUŠENSTVO","PARNE MEMBRANE IN PREGRADE, TRAKOVI, DODATNA OPREMA","MEMBRANAS Y BARRERAS DE VAPOR, CINTAS, ACCESORIOS","ÅNGMEMBRANER OCH BARRIÄRER, TEJP, TILLBEHÖR","DAMPFBREMSEN UND -SPERREN, KLEBEBÄNDER, ZUBEHÖR","BUHAR MEMBRAN VE BARİYERLER, BANTLAR, AKSESUARLAR","PÁRASZABÁLYOZÓ ÉS PÁRAZÁRÓ FÓLIÁK, SZALAGOK, KIEGÉSZÍTŐK"]
[235,"Trad235","DISPOSITIVI TEMPORANEI","DOČASNÁ ZAŘÍZENÍ","临时设备","PRIVREMENE SPRAVE","DISPOSITIFS TEMPORAIRES","一時的なデバイス","ΠΡΟΣΩΡΙΝΕΣ ΣΥΣΚΕΥΕΣ, ΤΑΙΝΙΕΣ ΚΑΙ ΑΞΕΣΟΥΑΡ","TEMPORARY DEVICES","PAGAIDU IERĪCES","URZĄDZENIA TYMCZASOWE","DISPOSITIVOS TEMPORÁRIOS","DISPOZITIVE TEMPORARE","ВРЕМЕННЫЕ УСТРОЙСТВА","DOČASNÉ ZARIADENIA","ZAČASNE NAPRAVE","DISPOSITIVOS TEMPORALES","TILLFÄLLIGA ENHETER","temporäre Einrichtungen","GEÇİCİ CİHAZLAR","IDEIGLENES ESZKÖZÖK"]
[236,"Trad236","FUNE","LANO","绳索","UŽE","CORDE","ロープ","ΣΧΟΙΝΙ ","WIRE","VIRVE","LINA","CORDA","FRÂNGHIE","ПРОВОД","WIRE","ŽICA","CABLE","TRÅD","Stahlseil","TEL","KÁBEL"]
[237,"Trad237","LINEA VITA NON RB","LANKOVÝ SYSTÉM NE RB","非RB生命线","LINIJA ŽIVOTA KOJA NIJE RB","LIGNE DE VIE NON RB","ライフラインはRBではありません","ΓΡΑΜΜΗ ΖΩΗΣ ΌΧΙ RB","LIFE LINE NOT RB","DZĪVES LĪNIJA NAV RB","LINIA ŻYCIA NIE RB","LINHA DE VIDA NÃO RB","LINIA VIAȚII NU RB","ЛИНИЯ ЖИЗНИ НЕ РБ","LIFE LIFE NOT RB","LIFE LINE NE RB","LÍNEA DE VIDA NO RB","LIVSLINJE INTE RB","LEBENSLINIE NICHT RB","YAŞAM HATTI RB DEĞİL","LEESÉSVÉDELMI RENDSZER NEM RB"]
[238,"Trad238","PUNTI D'ANCORAGGIO NON RB","KOTEVNÍ BODY NE RB","非RB单锚点","SIDRENE TOČKE KOJE NISU RB","POINTS D'ANCRAGE NON RB","RBではないアンカーポイント","ΣΗΜΕΙΑ ΑΓΚΥΡΩΣΗΣ ΟΧΙ RB","ANCHOR POINTS NOT RB","ENTURA PUNKTI Nav RB","PUNKTY KOTWICZĄCE NIE RB","PONTOS DE ANCORAGEM NÃO RB","PUNCTE DE ANCORA NU RB","ТОЧКИ ПРИКРЕПЛЕНИЯ НЕ RB","KOTVNÉ BODY NIE RB","SIDIŠČKE NE RB","PUNTOS DE ANCLAJE NO RB","FÖRANKNINGSPUNKTER EJ RB","Anschlagspunkte NICHT RB","ANCHOR NOKTALARI RB DEĞİL","KIKÖTÉSI PONTOK NEM RB"]
[239,"Trad239","RETI ANTICADUTA TEMPORANEE","DOČASNÉ OCHRANNÉ SÍTĚ PROTI PÁDU","临时防坠网","PRIVREMENE MREŽE ZA ZAŠTITU OD PADA","FILETS ANTICHUTE TEMPORAIRES","一時的な落下保護ネット","ΠΡΟΣΩΡΙΝΑ ΔΙΧΤΥΑ ΠΡΟΣΤΑΣΙΑΣ ΠΤΩΣΗΣ","TEMPORARY FALL PROTECTION NETS","PAGAIDU AIZSARDZĪBAS TĪKLI KRITIENIEM","TYMCZASOWE SIATKI ZABEZPIECZAJĄCE PRZED UPADKIEM","REDES DE PROTEÇÃO TEMPORÁRIAS ANTI-QUEDA","PLASE TEMPORARE DE PROTECTIE CU CAZARE","ВРЕМЕННЫЕ СЕТКИ ДЛЯ ЗАЩИТЫ ОТ ПАДЕНИЯ","DOČASNÉ OCHRANNÉ SIETE PROTI PÁDU","ZAČASNE MREŽE ZA ZAŠČITO PADCA","REDES TEMPORALES DE PROTECCIÓN anticaídas","TILLÄMPLIGA FALLSKYDDSNÄT","TEMPORÄRE FALLSCHUTZNETZE","GEÇİCİ DÜŞME AĞLARI","IDEIGLENES LEESÉSELLENI VÉDŐHÁLÓK"]
[240,"Trad240","ALTRO","JINÉ","其他","OSTALO","AUTRE","他の","ΑΛΛΑ","OTHER","CITI","INNY","OUTROS","ALTE","РАЗНОЕ","INÉ","DRUGO","OTRO","ÖVRIG","ANDERE","DİĞER","EGYÉB"]
[241,"Trad241","CASCHI","PŘILBY","头盔","KACIGE","CASQUES","ヘルメット","ΚΡΑΝΗ","HELMETS","Ķiveres","KASKI","CAPACETES","CĂȘTI","ШЛЕМЫ","PRILBY","ČELADE","CASCOS","HJÄLMAR","HELME","KASKLAR","SIAKOK"]
[242,"Trad242","IMBRACATURE","ZACHYCOVACÍ POSTROJE","安全带","POJASEVI","HARNAIS","ハーネス","ΖΩΝΕΣ","HARNESSES","drošības sistēmas","SZELKI","ARNÊS","HAMAMENTE","ЖГУТЫ","POPRUHY","PARSKE","ARNESES","SELAR","Gurte","KOŞUMLAR","HÁMOK"]
[243,"Trad243","ANTICADUTA","OCHRANA PROTI PÁDU","坠落制动","UREĐAJ ZA SPREČAVANJE PADA","ANTICHUTE","落下阻止","ΠΡΟΣΤΑΣΙΑ ΠΤΩΣΗΣ","FALL ARREST","KRITIENA Aizturēšana","ARESZTOWANIE UPADKU","ANTI-QUEDA","ARESTARE LA CADARE","ПАДЕНИЕ АРЕСТ","ZASTAVENIE PÁDU","PADEC APRES","anticaída","ARRESTERING","Absturzsicherung","GÜZ TUTUKLAMASI","KIKÖTÉSI RENDSZER"]
[244,"Trad244","POSIZIONAMENTO","POZICE","定位","POZICIONIRANJE","POSITIONNEMENT","ポジショニング","ΤΟΠΟΘΕΤΗΣΗ","POSITIONING","POZICIONĒŠANA","POZYCJONOWANIE","POSICIONAMENTO","POZIȚIONARE","ПОЗИЦИОНИРОВАНИЕ","UMIESTNENIE","POLOŽAJANJE","POSICIONAMIENTO","POSITIONERING","POSITIONIERUNG","KONUMLANDIRMA","POZÍCIONÁLÁS"]
[245,"Trad245","DISCENSORI / SISTEMI DI RISALITA","SLAŇOVACÍ / STOUPACÍ SYSTÉMY","下降器/上升系统","UREĐAJI ZA SPUŠTANJE/ SISTEMI ZA PENJANJE","DESCENDEURS / SYSTÈMES DE MONTÉE","ディセンダー/アセントシステム","ΣΥΣΤΗΜΑΤΑ ΚΑΘΟΔΟΥ / ΑΝΟΔΟΥ","DESCENDERS / ASCENT SYSTEMS","Nolaidēji","ZJAZDY / SYSTEMY WZNOSZENIA","SISTEMAS DESCENDENTES / SUBIDA","SISTEME DE COBORARE / ASCENSARE","СПУСКНЫЕ СИСТЕМЫ / ПОДЪЕМНЫЕ СИСТЕМЫ","DESCENDERS / SYSTÉMY VÝSTUPU","DESCENDERS / SISTEMI VZP","SISTEMAS DE DESCENSO / ASCENSO","DESCENDERS / UPPSTIGNINGSSYSTEM","AB-/AUFSTIEGSSYSTEME","İNDİRİCİLER / ÇIKIŞ SİSTEMLERİ","LESZÁLLÍTÓK / EMELKEDŐ RENDSZEREK"]
[246,"Trad246","KIT","KIT","成套工具","KIT","TROUSSE","キット","ΚΙΤ  ","KIT","KOMPLEKTS","ZESTAW","KIT","KIT","КОМПЛЕКТ","SÚPRAVA","KIT","kit","UTRUSTNING","KIT","KITI","KÉSZLET"]
[247,"Trad247","CORDE","LANA","绳索","UŽAD","CORDES","ロープ","ΣΧΟΙΝΙΑ","ROPES","VIRVES","LINY","CORDAS","FRÂNII","ВЕРЕВКИ","LANÁ","VRVI","CUERDAS","TÅGVIRKE","SEILE","İPLER","KÖTELEK"]
[248,"Trad248","DISPOSITIVI RETRATTILI","ZATAHOVACÍ ZAŘÍZENÍ","速差器","UREĐAJI NA UVLAČENJE","DISPOSITIFS RÉTRACTABLES","リトラクタブルデバイス","ΣΥΣΚΕΥΕΣ ΑΝΑΚΟΠΗΣ ΠΤΩΣΗΣ","RETRACTABLE DEVICES","IZVELKAMĀS IERĪCES","WYSUWANE URZĄDZENIA","DISPOSITIVOS RETRÁTEIS","DISPOZITIVE RETRACTIBILE","ВЫДВИЖНЫЕ УСТРОЙСТВА","VYSÚVACIE ZARIADENIA","IZVLEČNE NAPRAVE","DISPOSITIVOS RETRÁCTILES","INDRÄCKBARA ENHETER","Höhensicherungsgerät","ÇEKİLEBİLİR CİHAZLAR","BEVISSZOLHATÓ ESZKÖZÖK"]
[249,"Trad249","ANCORAGGI TEMPORANEI","DOČASNÁ KOTVENÍ","临时锚点","PRIVREMENA SIDRISTA","ANCRAGES TEMPORAIRES","一時的なアンカー","ΠΡΟΣΩΡΙΝΕΣ ΑΓΚΥΡΩΣΕΙΣ","TEMPORARY ANCHORAGES","PAGAIDU enkurvietas","TYMCZASOWE ZAKOTWIENIA","ANCORAGENS TEMPORÁRIAS","ANCORAJE TEMPORARE","ВРЕМЕННЫЕ КРЕПЛЕНИЯ","DOČASNÉ KOTVENIA","ZAČASNA SIDIŠČA","ANCLAJES TEMPORALES","TILLFÄLLIGA FÖRANKNINGAR","Temporäre Befestigung","GEÇİCİ ANKRAJLAR","IDEIGLENES RÖGZÍTÉSEK"]
[250,"Trad250","CONNETTORI","KONEKTORY","连接件","KONEKTORI","CONNECTEURS","コネクタ","ΣΥΝΔΕΣΕΙΣ","CONNECTORS","SAVIENOTĀJI","ZŁĄCZA","CONECTORES","CONECTOARE","СОЕДИНИТЕЛИ","KONEKTORY","KONEKTORJI","CONECTORES","KONTAKTER","Verbinder","KONEKTÖRLER","CSATLAKOZÓK"]
[251,"Trad251","CARRUCOLE","KLADKA","滑轮","ČEKRK","POULIE","プーリー","ΤΡΟΧΑΛΙΑ","PULLEY","TRULIS","KRĄŻEK LINOWY","POLIA","SCRIPETE","ШКИВ","KLADKA","Jermenica","POLEA","REMSKIVA","ROLLE","KASNAK","CSIGA"]
[252,"Trad252","TRIPODI","TROJNOŽKA","三脚架","TRONOŽCI","TRÉPIEDS","三脚","ΤΡΙΠΟΔΕΣ","TRIPODS","Trijkāji","STATYWY","TRIPÉS","TREPIODELE","ШТАТИВЫ","STROJÍKY","STATIVI","TRÍPODES","STATIV","Dreibein","TRİPODLAR","ÁLLVÁNYOK"]
[253,"Trad253","GRU","JEŘÁB","起重机","KRAN","GRUE","クレーン","ΓΕΡΑΝΟΣ","CRANE","CELTņi","DŹWIG","GUINDASTE","MACARA","КРАН","CRANE","ŽIVEL","GRUA","KRAN","KRAN","VİNÇ","DARU"]
[254,"Trad254","E","A","和","I","ET","と","ΚΑΙ","AND","UN","ORAZ","E","ȘI","И","A","IN","Y","OCH","UND","VE","ÉS"]
[255,"Trad255","ANCORANTE AVVITABILE","ŠROUBOVATELNÁ KOTVA","可拧锚点","SIDRO KOJE SE ZAVRČE","CHEVILLE A VISSER","スクリュー可能なアンカー","ΑΓΚΥΡΙΟ ΜΕ ΒΙΔΑ","SCREWABLE ANCHOR","Skrūvējams enkurs","KOTWY WKRĘCANE","ÂNCORANTE APARAFUSÁVEL","ANCORA SURUBABLE","ВИНТОВОЙ АНКЕР","SKRUTKOVATEĽNÁ KOTVA","SIDRO NA VIJAČ","anclaje atornillable","SKRUVBART ANKER","SCHRAUBANKER","VİDALANABİLİR ANKRAJ","CSAVAROZHATÓ RÖGZÍTŐ"]
[256,"Trad256","TASSELLI MECCANICI","MECHANICKÉ KOTVY","机械锚固","MEHANIČKA SIDRA","CHEVILLES MÉCANIQUES","機械ダボ","ΜΗΧΑΝΙΚΑ ΑΓΚΥΡΙΑ","MECHANICAL ANCHORS","MEHĀNISKIE DĪBEĻI","KOŁKI MECHANICZNE","ANCORANTES METÁLICOS","DIBLURI MECANICE","МЕХАНИЧЕСКИЕ АНКЕРЫ","MECHANICKÉ KOTVY","MEHANSKA SIDRA","ANCLAJES MECÁNICOS","MEKANISKA ANKARE","MECHANISCHE ANKER","MEKANİK ANKRAJ","MECHANIKUS RÖGZÍTÉSEK"]
[257,"Trad257","RESINE E COLLE","PRYSKYŘICE A LEPIDLA","树脂和胶水","SMOLE I LJEPILA","RÉSINES ET COLLES","樹脂と接着剤","ΡΗΤΙΝΕΣ ΚΑΙ ΚΟΛΛΕΣ","RESINS AND GLUES","enkurmasas UN LĪMES","ŻYWICE I KLEJE","RESINAS E COLAS","RĂȘINI ȘI Adezivi","СМОЛЫ И КЛЕИ","ŽIVICE A LEPIDLÁ","SMOLE IN LEPILA","RESINAS Y COLAS","KARTA OCH LIM","HARZE UND KLEBSTOFFE","REÇİNELER VE TUTKALLAR","GYANTÁK ÉS RAGASZTÓK"]
[258,{"$f":"+_xlfn.CONCAT(\"Trad\",A258)","v":"Trad258"},"BARRE FILETTATE","ZÁVITOVÉ TYČE","螺纹杆","NAVOJNE ŠIPKE","BARRES FILETÉES","ねじ山バー","ΝΤΙΖΕΣ","THREADED BARS","VĪTņSTIEŅI","PRĘTY GWINTOWANE","VARÕES ROSCADOS","BARE FILETATE","РЕЗЬБОВЫЕ ШПИЛЬКИ","ZÁVITOVÉ TYČE","NAVOJNE LESKE","BARRAS ROSCADAS","GÄNGAD STÄNGOR","GEWINDESTANGEN","DİŞLİ ÇUBUKLAR","MENETES SZÁRAK"]
[259,"Trad259","DOPPIO TRAFILATO SU MISURA","DVOJZÁVITOVÉ TYČE NA MÍRU","预穿孔双螺纹杆","NAMJESTIVE DVOSTRUKE NAVOJNE ŠIPKE","DOUBLE DESSIN SUR MESURE","二重に描かれた測定","ΔΙΠΛΕΣ ΝΤΙΖΕΣ","BESPOKEN DOUBLE THREADED BARS","SPECIĀLIE vītņstieņi","PODWÓJNIE RYSOWANE NA MIARĘ","VARÃO DUPLO POR MEDIDA","DUBLU TRAS FĂCUT PE MĂSURĂ","ДВОЙНАЯ РЕЗЬБА ПО ЗАКАЗУ","TYČE S DVOJITÝM ZÁVITOM NA MIERU","DVOJNE NAVOJNE LETKE PO PO meri","BARRAS DOBLE ROSCA A MEDIDA","SKRÄDDARSYDDA DUBBELTÄGADE STÄNGOR","MASSGESCHNEIDERTE DOPPELTE GEWINDESTANGEN","ÖZEL ÇİFT DİŞLİ ÇUBUKLAR","MÉRETRE KÉSZÜLT KETTŐS MENETES SZÁRAK"]
[260,"Trad260","CONTROVENTO","ZAVĚTRÁVANÍ","支架","UKLJUČIVANJE","ENTRETOISEMENT","ブレーシング","ΓΙΑ ΣΤΗΡΙΞΗ","BRACING","Savilces","ORZEŹWIAJĄCY","CONTRAVENTAMENTO","CONTRIBUIREA","СВЯЗЬ","BRACING","OPREMA","contraviento","UPPIGGANDE","Windverband","GÜÇLENDİRME","RÖGZÍTŐ"]
[261,"Trad261","% Viti a grano in più","% přídavných stavěcích šroubů","% 额外的平头螺钉","% dodatnih vijaka","% de vis sans tête supplémentaires","％追加のグラブネジ","% πρόσθετες βίδες ","% addiotional grub screws","% papildu skrūves","% dodatkowych wkrętów dociskowych","% parafusos adicionais","% șuruburi de fixare suplimentare","% дополнительные установочные винты","% dodatočných závitových kolíkov","% dodatnih vijakov","% tornillo sin cabeza adicional","% extra stiftskruvar","% zusätzliche Madenschrauben","% ek başsız vidalar","% további csigacsavarok"]
[262,"Trad262","PROFONDITA' OSTACOLO","HLOUBKA PŘEKÁŽKY","障碍物深度","DUBINA PREPREKE","PROFONDEUR DE L'OBSTACLE","障害物深さ","ΒΑΘΟΣ ΕΜΠΟΔΙΟΥ","OBSTACLE DEPTH","ŠĶĒRŠĻU DZIĻUMS","GŁĘBOKOŚĆ PRZESZKODY","PRODUNDIDADE DO OBSTÁCULO","ADÂNCIMEA OBSTACOLULUI","ДЛИНА ОБСТАНАВЛИВАНИЯ","HĹBKA OBSTACLE","GLOBINA OVIRE","PROFUNDIDAD DEL OBSTÁCULO","OBSTACLE DJUP","OBSTACLE TIEFE","ENGEL DERİNLİĞİ","AKADÁLY MÉLYSÉGE"]
[263,"Trad263","SPESSORE CORDOLO","Tloušťka obrubníku","路缘石厚度","DEBLJINA RUBA","ÉPAISSEUR DU KERB","縁石の幅","ΚΑΘΑΡΙΣΜΕΝΟ ΠΑΧΟΣ","KERB THICKNESS","IEROBEŽojumu BIEZUMS","GRUBOŚĆ KRAWĘŻNIKA","ESPESSURA DO ","GROSIMEA MIEZULUI","ТОЛЩИНА КЕРБА","HĹBKA KERBU","DEBELINA GRUDE","espesor al borde","TJOCKLEK","KERB-DICKHEIT","KERBET KALINLIĞI","SZEGÉLY VASTAGSÁGA"]
[264,"Trad264","SCALETTA DI DISCESA","Sestupový žebřík","下降梯","LJESTVE KOJE SE SPUŠTAJU","DESCENT LADDER","下降梯子","ΣΚΑΛΑ ΚΑΤΑΒΑΣΗΣ","DESCENT LADDER","NOLAIšanās KĀPNES","DRABINA ZJAZDOWA","ESCADA DE DESCIDA","COBORÂRE DE COBORÂRE","ЛЕДНИК СВОБОДЫ","SADLÁ DESCENT","DESCENT LADDER","ESCALERA DE DESCENSO","NEDGÅNGSLYFTSLYFT","LADDER INNEN-AUSTIEG","İNİŞ MERDİVENİ","ERESZKEDŐ LÉTRA"]
[265,"Trad265","(E) Maggiore di 450 mm","Více než 450 mm","（E）大于450毫米","(E) VEĆE OD 450 MM","(E) Supérieur à 450 mm","(E) 450mmを超える","(Ε) Πάνω από 450 mm","(E) Greater than 450 mm","(E) Lielāks par 450 mm","(E) Większa niż 450 mm","(E) Maior do que 450mm","(E) Mai mare de 450 mm","(E) Более 450 мм","(E) Viac ako 450 mm","(E) Več kot 450 mm","(E) Mayor de 450 mm","(E) Större än 450 mm","(E) Größer als 450 mm","(E) 450 mm'den büyük","(E) Nagyobb, mint 450mm"]
[266,"Trad266","Minore di","Méně než","少于","MANJE OD","Moins de","未満","Λιγότερο από","Less than","Mazāk nekā","Mniej niż","Menor de","Mai puțin de","Менее","Menej ako","Manj kot","Menrs de","Mindre än","Weniger als","Daha az","kevesebb mint"]
[267,"Trad267","Su richiesta SBARCO maggiore di 750 mm","Na vyžádání vstup větší než 750 mm","根据要求，着陆距离大于750毫米","NA ZAHTJEV SILAŽENJE VEĆE OD 750 MM","Sur demande DEBOUT Plus de 750 mm","要望に応じてランディング750mm以上","Κατόπιν αιτήματος ΠΡΟΣΓΕΙΩΣΗ Μεγαλύτερο από 750 mm","On request LANDING Greater than 750 mm","Pēc pieprasījuma - Lielāks par 750 mm","Na życzenie LĄDOWANIE Większe niż 750 mm","Sobre pedido ATERRAGEM maior de 750 mm","La cerere MAI JOS DE 750 mm","По запросу НИЖЕ 750 мм","Na požiadanie Nižšie ako 750 mm","Na zahtevo NIŽJE OD 750 mm","A petición del cliente desembarque Mayor de 750 mm","På begäran LÄNGRE än 750 mm","Auf Anfrage LANDING Größer als 750 mm","İstek üzerine 750 mm'den DAHA DÜŞÜK","Igény esetén LANDING nagyobb, mint 750mm"]
[268,"Trad268","Su richiesta","Na vyžádání","应要求","NA ZAHTJEV","Sur demande","要望に応じて","Κατόπιν αίτησης","On request","Pēc pieprasījuma","Na życzenie","Sobre pedido","La cerere","По запросу","Na požiadanie","Na zahtevo","A petición","På begäran","Auf Anfrage","İstek üzerine","igény esetén"]
[269,"Trad269","Opzione Default","Výchozí možnost","选项默认值","UOBIČAJNA OPCIJA","Option par défaut","デフォルトオプション","Standard επιλογή","Option Default","Opcija - pēc noklusējuma","Opcja domyślna","Opção por defeito","Opțiune implicită","Опция По умолчанию","Predvolená možnosť","Privzeta možnost","Opción por defecto","Alternativ Standard","Option Standard","Seçenek Varsayılan","Alapértelmezett verzió"]
[270,"Trad270","Necessaria protezione","Je vyžadována ochrana","需要保护","OBAVENA ZAŠTITA","Protection requise","必要な保護機能","Απαιτείται προστασία","Protection required","Nepieciešama aizsardzība","Wymagana ochrona","Necessária proteção","La cerere Protecție necesară","По запросу Требуется защита","Požadovaná ochrana","Na zahtevo Zahtevana zaščita","Protección necesaria","På begäran Skydd krävs","Schutz erforderlich","Gerekli koruma","Védelem szükséges"]
[271,"Trad271","Forma","Tvar","形状","OBLIK","Forme","形状","Σχήμα","Shape","Forma","Kształt","Forma","Formă","Форма","Tvar","Oblika","Forma","Form","Form","Şekil","forma"]
[272,"Trad272","Rettangolare","Obdélníkový","矩形的","PRAVOKUTAN","Rectangulaire","長方形","Ορθογώνιος","Rectangular","Taisnstūrveida","Prostokątny","Retangular","Rectangular","Прямоугольная","Obdĺžnikový","Pravokotni","Rectangular","Rektangulär","Rechteckig","Dikdörtgen","négyzet"]
[273,"Trad273","Circolare","Kruhový","圆形的","KRUŽAN","Circulaire","円形","Εγκύκλιος","Circular","Apļveida","Okrągły","Circular","Circular","Круглый","Kruhový","Krožni","Circular","Cirkulär","rund","Dairesel","kör"]
[274,"Trad274","Raggio","Poloměr","半径","RADIJUS","Rayon","半径","Ακτίνα κύκλου","Radius","Rādiuss","Promień","Ráio","Radius","Радиус","Polomer","Radij","Radio","Radius","Radius","Yarıçap","átmérő"]
[275,"Trad275","Larghezza","Šířka","宽度","ŠIRINA","Largeur","幅","Πλάτος","Width","Platums","Szerokość","Largura","Lățime","Ширина","Šírka","Širina","Anchura","Bredd","Breite","Genişlik","szélesség"]
[276,"Trad276","Lunghezza","Délka","长","DULJINA","Longueur","長さ","Μήκος","Length","Garums","Długość","Comprimento","Lungime","Длина","Dĺžka","Dolžina","Longitud","Längd","Länge","Uzunluk","hossz"]
[277,"Trad277","Superficie (mq)","Plocha (m2)","表面（平方米）","POVRŠINA M2","Surface (m²)","表面積(㎡)","Επιφάνεια (τμ)","Surface (sqm)","Virsma (kvm)","Powierzchnia (m2)","Superficíe (m2)","Suprafața (mp)","Площадь поверхности (кв. м)","Plocha (m2)","Površina (m2)","Superficie (m2)","Yta (kvm)","Fläche (qm)","Yüzey alanı (metrekare)","felület (nm)"]
[278,"Trad278","Codice per richiesta","Požadovaný kód","请求代码","KOD ZA ZAHTJEV","Code pour la demande","リクエスト用コード","Κωδικός για αίτημα","Code for request","Kods pieprasījumam","Kod na żądanie","Codigo de pedido","Cod pentru cerere","Код для запроса","Kód žiadosti","Koda za zahtevo","Código de solicitud","Kod för begäran","Kodex für Anfrage","İstek için kod","Ajánlat száma"]
[279,"Trad279","Dimensioni","Rozměry","尺寸","DIMENZIJE","Dimensions","外形寸法図","Διαστάσεις","Dimensions","Izmēri","Wymiary","Dimensões","Dimensiuni","Размеры","Rozmery","Dimenzije","Dimensiones","Mått","Abmessungen","Boyutlar","méretek"]
[280,"Trad280","Superficie Totale (mq)","Celková plocha (m2)","总面积（平方米）","TOTALNA POVRŠINA M2","Surface totale (m²)","表面積合計(㎡)","Συνολική επιφάνεια (τμ)","Total surface (sqm)","Kopējā platība (kvm)","Całkowita powierzchnia (m2)","Superficie Total (m2)","Suprafața totală (mp)","Общая площадь (кв. м)","Celková plocha (m2)","Skupna površina (m2)","Superficie total (m2)","Total yta (kvm)","Gesamtfläche (qm)","Toplam Yüzey (m²)","teljes felület (nm)"]
[281,"Trad281","Superficie Subtotale (mq)","Mezisoučet plochy (m2)","小计表面（平方米）","MEĐUZBROJ POVRŠINE M2","Surface sous-totale (m²)","表面積小計（㎡）","Μερική επιφάνεια (τμ)","Subtotal surface (sqm)","Kopējā platība (kvm)","Powierzchnia częściowa (m2)","Superficie SubTotal (m2)","Suprafața subtotală (mp)","Итоговая площадь (кв. м)","Medzisúčet plôch (m2)","Vmesna površina (m2)","Superficie subtotal (m2)","Del av ytan (kvm)","Zwischensumme Fläche (qm)","Toplam yüzey (metrekare)","részleges felület (nm)"]
[282,"Trad282","Prezzo Listino/mq","Doporučená prodejní cena/m2","标价/平方米","CIJENA U CJENIKU/M2","Prix de liste/m².","定価/㎡","Τιμή καταλόγου/τμ","List price/sqm","Mazumtirdzniecības cena/kvm","Cena katalogowa/m2","Preço de Lista/m2","Preț de listă/mp","Прейскурантная цена/кв.м","Cenníková cena/m²","Knjižna cena/kvadratni meter","Precio de lista/metro cuadrado","Listapris/kvm","Listenpreis/qm","Liste fiyatı/metrekare","listaár/nm"]
[283,"Trad283","Prezzo Netto/mq","Nákupní cena/m2","净价/平方米","NETO CIJENA/M2","Prix net/m2","税込み価格/㎡","Καθαρή τιμή/τμ","Net price/sqm","Neto cena/kvm","Cena netto/m2","Preço Liquído/m2","Preț net/mp","Чистая цена/кв.м","Čistá cena/m²","Neto cena/kvadratni meter","Precio neto/m²","Nettopris/kvm","Nettopreis/qm","Net fiyat/metrekare","kedvezményes ár/nm"]
[284,"Trad284","Costo Materiale + altre spese/mq","Cena materiálu + ostatní náklady/m2","材料成本+其他费用/平方米","TROŠAK MATERIJALA+OSTALI TROŠKOVI/M2","Coût des matériaux + autres dépenses/m².","材料費＋その他経費/㎡","Κόστος υλικού + λοιπά έξοδα/τμ","Material cost + other expenses/sqm","Materiālu izmaksas + citi izdevumi/kvm","Koszt materiałów + inne wydatki/m2","Custo Material + outras despesas/m2","Costul materialelor + alte cheltuieli/mp","Стоимость материала + прочие расходы/кв.м","Náklady na materiál + ostatné náklady/ m2","Stroški materiala + drugi stroški/kvadratni meter","Coste del material + otros gastos/m2","Materialkostnad + övriga kostnader/kvm","Materialkosten + sonstige Kosten/qm","Malzeme maliyeti + diğer giderler/metrekare","anyagköltség+egyéb költségek/nm"]
[285,"Trad285","Tipo Installazione","Typ instalace","安装类型","TIP INSTALACIJE","Type d'installation","インストールタイプ","Τύπος εγκατάστασης","Installation type","Uzstādīšanas veids","Typ instalacji","Tipo de Instalação","Tipul de instalare","Тип установки","Typ Inštalácia","Vrsta Namestitev","Tipo de instalación","Typ Installation","Einbauart","Tip Kurulum","Szerelés típusa"]
[286,"Trad286","Schema","Schéma","计划","SHEMA","Schéma","スキーム","Σχέδιο","Scheme","Shēma","Schemat","Esquema","Schema","Схема","Schéma","Shema","Esquema","Ordning","Schema","Şema","minta"]
[287,"Trad287","Listello 40x50 mm","Lať 40x50 mm","板条40x50毫米","LETVA 40X50 MM","Bande de 40x50 mm","桟40×50mm","Δοκαρι 40x50 mm","Batten 40x50 mm","Līste 40x50 mm","Listwa 40x50 mm","Sarrafo 40x50 mm","Lat 40x50 mm","Планка 40x50 мм","Lišta 40x50 mm","Lamela 40x50 mm","Listón 40x50 mm","Lath 40x50 mm","Latte 40x50 mm","Çıta 40x50 mm","cserépléc"]
[288,"Trad288","Omega \"L\" 30x30x2 mm","Omega \"L\" 30x30x2 mm","Omega“L”30x30x2毫米","Omega \"L\" 30x30x2 mm","Omega \"L\" 30x30x2 mm","オメガ \"L\" 30x30x2 mm","Omega \"L\" 30x30x2 mm","Omega \"L\" 30x30x2 mm","Omega \"L\" 30x30x2 mm","Omega \"L\" 30x30x2 mm","Omega \"L\" 30x30x2 mm","Omega 'L' 30x30x2 mm","Омега 'L' 30x30x2 мм","Omega \"L\" 30x30x2 mm","Omega 'L' 30x30x2 mm","Omega \"L\" 30x30x2 mm","Omega \"L\" 30x30x2 mm","Omega \"L\" 30x30x2 mm","Omega 'L' 30x30x2 mm","Omega \"L\" 30x30x2 mm"]
[289,"Trad289","LBB4030 40x3 mm","LBB4030 40x3 mm","LBB430 40x3毫米","LBB4030 40x3 mm","LBB4030 40x3 mm","LBB4030 40x3 mm","LBB4030 40x3 χλστ","LBB4030 40x3 mm","LBB4030 40x3 mm","LBB4030 40x3 mm","LBB4030 40x3 mm","LBB4030 40x3 mm","LBB4030 40x3 мм","LBB4030 40x3 mm","LBB4030 40x3 mm","LBB4030 40x3 mm","LBB4030 40x3 mm","LBB4030 40x3 mm","LBB4030 40x3 mm","LBB4030 40x3 mm"]
[290,"Trad290","Accessorio di Fissaggio","Upevňovací příslušenství","固定配件","PRIBOR ZA PRIČVRŠĆIVANJE","Accessoire de fixation","締結用アクセサリー","Εξάρτημα στερέωσης","Fixing accessory","Fiksācijas piederums","Akcesoria do mocowania","Acessórios de Fixação","Accesoriu de fixare","Крепежный аксессуар","Upevňovacie príslušenstvo","Oprema za pritrjevanje","Accesorio de fijación","Tillbehör för fastsättning","Zubehör für die Befestigung","Sabitleme aksesuarı","Rögzítő tartozékok"]
[291,"Trad291","PRODOTTO SU RICHIESTA","Produkt na vyžádání","按要求提供产品","PROIZVOD NA ZAHTJEV","PRODUIT SUR DEMANDE","要望への対応品","ΠΡΟΪΟΝ ΚΑΤΟΠΙΝ ΑΙΤΗΣΗΣ","PRODUCT ON REQUEST","PRECES PĒC PIEPRASĪJUMA","PRODUKT NA ZAMÓWIENIE","PRODUTO SOBRE PEDIDO ESPECIAL","PRODUS LA CERERE","ПРОДУКТ ПО ЗАПРОСУ","VÝROBOK NA POŽIADANIE","IZDELEK NA ZAHTEVO","PRODUCTO solicitado","PRODUKT PÅ BEGÄRAN","PRODUKT AUF ANFRAGE","ISTEK ÜZERINE ÜRÜN","Termék rendelésre"]
[292,"Trad292","TIPO DI SISTEMA","Typ systému","系统类型","TIP SISTEMA","TYPE DE SYSTÈME","システムタイプ","ΤΥΠΟΣ ΣΥΣΤΗΜΑΤΟΣ","SYSTEM TYPE","SISTĒMAS VEIDS","RODZAJ SYSTEMU","TIPO DE SISTEMA","TIP DE SISTEM","ТИП СИСТЕМЫ","TYP SYSTÉMU","VRSTA SISTEMA","TIPO DE SISTEMA","SYSTEM TYP","SYSTEMTYP","SİSTEM TİPİ","Rendszer fajtája"]
[293,"Trad293","Altezza Supporto","Výška podpěry","支撑高度","VISINA POTPORNJA","Hauteur du support","高さ方向のサポート","Ύψος στήριξης","Support height","Atbalsta augstums","Wysokość podparcia","Altura do suporte","Suport de înălțime","Поддержка высоты","Podpora výšky","Podpora za višino","Altura del soporte","Stöd för höjd","Höhe der Stütze","Yükseklik Desteği","Támaszték magassága"]
[294,"Trad294","Scaletta","Žebřík","梯子","LJESTVE","Échelle","梯子","Σκάλα","Ladder","Kāpnes","Drabina","Escada","Scară","Лестница","Rebrík","Lestev","Escalera","Stege","Leiter","Merdiven","létra"]
[295,"Trad295","Con ancoranti","S kotvami","用锚固点","SA SIDRIMA","Avec ancrages","アンカー付き","Με άγκυρες","With anchors","Ar enkuriem","Z kotwami","com ancorante","Cu ancore","С якорями","S kotvami","S sidrišči","Con anclajes","Med ankare","Mit Verankerungen","Ankrajlar ile","rögzítőkkel"]
[296,"Trad296","Con zavorra","Se zátěží","带压舱物","SA TERETOM","Avec ballast","バラスト付き","Με έρμα","With ballast","Ar balastu","Z balastem","com balastro","Cu balast","С балластом","So záťažou","Z balastom","Con lastre","Med ballast","Mit Auflast","Balast ile","ellensúllyal"]
[297,"Trad297","Piano + parapetti","Podlaha + zábradlí","地板+护栏","POD+TRAČNICA","Plancher + garde-corps","床＋手すり","Δάπεδο + προστατευτικό κιγκλίδωμα","Floor + guardrail","Grīda + margas","Podłoga + poręcz","pavimento + parapeito","Podele + balustrade","Пол + перила","Podlaha + zábradlie","Tla + ograje","Suelo + barandilla","Golv + räcken","Boden + Geländer","Zemin + korkuluklar","padló + korlát"]
[298,"Trad298","Utile","Užitečný","有用的","KORISTAN","Utile","便利な","Χρήσιμος","Useful","Noderīga","Użyteczne","útil","Util","Полезное","Užitočné","Uporabno","Útil","Användbar","Nützlich","Faydalı","hasznos"]
[299,"Trad299","Altezza","Výška","身高","VISINA","Hauteur","高さ","Υψος","Height","Augstums","Wysokość","Altura","Înălțime","Высота","Výška","Višina","Altura","Höjd","Höhe","Yükseklik","magasság"]
[300,"Trad300","Linea Vita Orizzontale","Horizontální lankový systém","水平生命线","HORIZONTALNA LINIJA ŽIVOTA","Ligne de vie horizontale","水平ライフライン","Οριζόντια σανίδα σωτηρίας","Horizontal lifeline","Horizontālā glābšanas līnija","Pozioma linia życia","Linha de Vida Horizontal","Linie de salvare orizontală","Горизонтальный спасательный круг","Horizontálne záchranné lano","Vodoravna rešilna vrv","Línea de vida horizontal","Horisontell livlina","Horizontale Lebenslinie","Yatay yaşam hattı","vízszintes kikötési rendszer"]
[301,"Trad301","Scalini","Kroky","台阶","STEPENICE","Étapes","階段","Σκαλιά","Steps","Soļi","Kroki","Degraus","Pași","Шаги","Kroky","Koraki","escalones","Steg","Tritte","Adımlar","lépés"]
[302,"Trad302","Compilare","Vyplnit","填补","ISPUNITI","Remplir","入力する","Να γεμιστεί","Fill in","Piepildīt","Wypełnić","Preencher","Completați","Заполнить","Vyplňte","Izpolnite","Rellenar","Fyll i","ausfüllen","Doldurun","kitölteni"]
[303,"Trad303","Materiale","Materiál","材料","MATERIJAL","Matériau","材料","Υλικό","Material","Materiāls","Materiał","Material","Material","Материал","Materiál","Material","Material","Material","Material ","Malzeme","anyag"]
[304,"Trad304","Su copertura con Shed","Na střeše přístřešku","棚顶","NA NAGNUTOM KROVU","En couverture avec Shed","片流れ屋根の上","Στη στέγη του υπόστεγου","On cover with Shed","Uz nojumes jumta","Na dachu skośnym","Sobre cobertura com Shed","Pe acoperișul șopronului","На крыше сарая","Na streche prístrešku","Na strehi nadstreška","Cubierta con shed","På taket till skjulet","für Scheddach/Trapezblechdach","Baraka çatısında","magastetőn"]
[305,"Trad305","Su copertura piana","Na ploché střeše","在平屋顶上","NA RAVNOM KROVU","Sur un toit plat","陸屋根の上","Σε επίπεδη στέγη","On flat roof","Uz plakana jumta","Na płaskim dachu","Sobre cobertura plana","Pe acoperiș plat","На плоской крыше","Na plochej streche","Na ravni strehi","Cubierta plana","På platta tak","für Flachdach","Düz çatıda","lapostetőn"]
[306,"Trad306","Su copertura con pannelli sandwich","Na střeše se sendvičovými panely","在夹芯板屋顶上","NA KROVU OD SENDVIĆ PANELA","Sur le toit avec des panneaux sandwichs","サンドイッチパネル屋根の上","Στην οροφή με πάνελ σάντουιτς","On roof with sandwich panels","Uz jumta ar sendvičpaneļiem","Na dachu z płyt warstwowych","Sobre cobertura com painel sandwich","Pe acoperiș cu panouri sandwich","На крыше с использованием сэндвич-панелей","Na streche so sendvičovými panelmi","Na strehi s sendvič ploščami","Cubierta con panel sandwich","På tak med sandwichpaneler","für Sandwichdach","Sandviç panelli çatıda","szendvicspanel tetőn"]
[307,"Trad307","Freccia/altezza Shed","Šipka /výška haly","箭头/高度棚","STRELICA/","Flèche/hauteur Hangar","矢印/高さ 片流れ屋根","Υπόστεγο βέλους/ύψους","Arrow/height Shed","Bulta/augstums Šķūnis","Strzałka/wysokość ","altura Shed","Săgeată/înălțime Șopron","Стрела/высота Сарай","Šípka/výška Prístrešok","Puščica/višina Nadstrešek","Flecha/altura shed","Pil/höjd Skjul","Pfeil/Höhe Shed","Ok/yükseklik Sundurma","Nyíl/magasság Shed"]
[308,"Trad308","Interasse Travi Y","Vzdálenost mezi nosníky Y","梁间距Y","UDALJENOST IZMEĐU GREDA Y","Distance entre les poutres Y","梁間の距離 Y","Απόσταση μεταξύ δοκών Υ","Distance between beams Y","Attālums starp sijām Y","Odległość między belkami Y","vão entre viga Y","Distanța dintre grinzi Y","Расстояние между балками Y","Vzdialenosť nosníkov Y","Razmik med nosilci Y","Intereje vigas Y","Avstånd mellan balkarna Y","Balkenabstand","Kiriş aralığı Y","Gerendák közötti távolság Y"]
[309,"Trad309","Direzione Passerella","Směr cesty","走道方向","SMJER STAZE ZA HODANJE","Direction de la passerelle","通路の方向","Κατεύθυνση πεζοδρομίου","Walkway direction","Gājiena virziens","Kierunek chodnika","Direção do Passadiço","Direcția pasarelei","Направление пешеходной дорожки","Smer chodníka","Smer sprehajalne poti","Dirección pasarela","Gångbanans riktning","Laufstegrichtung","Yürüyüş yolu yönü","Haladási irány"]
[310,"Trad310","Distanziamento da muro","Vzdálenost od zdi","离墙的距离","UDALJENOST OD ZIDA","Distance par rapport au mur","壁面からの距離","Απόσταση από τοίχο","Distance from wall","Attālums no sienas","Odległość od ściany","Distância ao muro","Distanța față de perete","Расстояние от стены","Vzdialenosť od steny","Oddaljenost od stene","separación del muro","Avstånd från väggen","Abstand zur Mauer","Duvara olan mesafe","faltól mért távolság"]
[311,"Trad311","Interasse mensole","Rozestup držáků","支架间距","UDALJENOST IZMEĐU NOSAČA","Espacement des supports","ブラケット間隔","Διάστιχο βραχίονα","Bracket spacing","Kronšteinu atstatums","Rozstaw wsporników","Distância entre Brackets","Distanța dintre suporturi","Расстояние между кронштейнами","Vzdialenosť medzi konzolami","Razmik med nosilci","Intereje mensula","Avstånd mellan konsoler","Abstand zwischen den Klammern","Braket aralığı","keret távolsága"]
[312,"Trad312","Accesso laterale","Boční vstup","侧面通道","BOČNI PRISTUP","Accès latéral","側面アクセス","Πλευρική πρόσβαση","Side access","Sānu piekļuve","Dostęp z boku","Acesso lateral","Acces lateral","Боковой доступ","Bočný prístup","Stranski dostop","Acceso lateral","Tillträde på sidan","seitlicher Zugang","Yan erişim","Oldal irányú feljutási pont"]
[313,"Trad313","Accesso frontale","Přední vstup","正面通道","PRISTUP OD NAPRIJED","Accès frontal","前面アクセス","Μπροστινή πρόσβαση","Frontal access","Frontāla piekļuve","Dostęp od przodu","Acesso frontal","Accesul frontal","Фронтальный доступ","Čelný prístup","Frontalni dostop","acceso frontal","Tillträde framifrån","vorderer Zugang","Önden erişim","Feljutási pont"]
[314,"Trad314","Parapetti Laterali","Boční zábradlí","侧栏杆","BOČNE TRAČNICE","Rampes latérales","側面パラペット","Πλαϊνά κάγκελα","Side railings","Sānu margas","Balustrady boczne","Parapeitos laterais","Balustrade laterale","Боковые ограждения","Bočné zábradlia","Stranske ograje","barandilla lateral","Sidogrindar","seitliche Geländer","Yan korkuluklar","oldalsó korlát"]
[315,"Trad315","Singolo lato","Jedna strana","单面","S JEDNE STRANE","Côté unique","片面","Μονή πλευρά","Single side","Viena puse","Pojedyncza strona","Unilateral","O singură față","Одна сторона","Jedna strana","Ena stran","lado único","Enkel sida","einseitig","Tek taraf","egyik oldal"]
[316,"Trad316","Entrambi i lati","Obě strany","双面","S OBJE STRANE","Les deux côtés","両側","Δυο πλευρες","Both sides","Abas puses","Obie strony","Bilateral","Ambele părți","Обе стороны","Obe strany","Obe strani","Ambos lados","Båda sidorna","zweiseitig","Her İki Taraf","mindkét oldal"]
[317,"Trad317","Tipo Accesso","Typ Přístup","类型访问","Vrsta pristupa","Type d'accès","タイプアクセス","Τύπος Πρόσβαση","Type of access","Tips Piekļuve","Typ Dostęp","Tipo Acesso","Tipul de acces","Тип доступа","Typ prístupu","Vrsta dostopa","Tipo de acceso","Typ av tillträde","Art des Zugangs","Erişim türü","Típus Hozzáférés"]
[318,"Trad318","Shed","Bouda","棚屋","šupa","Hangar","上屋","Υπόστεγο","Shed","Nojume","Szopa","Galpão","Șopron","Сарай","Prístrešok","Nadstrešek","Cobertizo","Skjul","Schuppen","Baraka","Shed"]
[319,"Trad319","ALTEZZA TOTALE SCALA","CELKOVÁ VÝŠKA SCHODIŠTĚ","楼梯总高度","SKALA UKUPNE VISINE","HAUTEUR TOTALE DE L'ESCALIER","階段の総高さ","ΣΥΝΟΛΙΚΌ ΎΨΟΣ ΣΚΆΛΑΣ","TOTAL LADDER HEIGHT","KOPĒJAIS KĀPŅU AUGSTUMS","CAŁKOWITA WYSOKOŚĆ SCHODÓW","ALTURA TOTAL DA ESCADA","ÎNĂLȚIMEA TOTALĂ A SCĂRII","ОБЩАЯ ВЫСОТА ЛЕСТНИЦЫ","CELKOVÁ VÝŠKA SCHODOV","SKUPNA VIŠINA STOPNIŠČA","ALTURA TOTAL DE LA ESCALERA","TOTAL HÖJD PÅ TRAPPAN","GESAMTTREPPENHÖHE","TOPLAM MERDIVEN YÜKSEKLIĞI","TELJES LÉPCSŐMAGASSÁG"]
[320,"Trad320","PENULTIMO TRATTO INTERMEDIO","PŘEDPOSLEDNÍ MEZITÍMNÍ ÚSEK","倒数第二中级部","PRETHODNI SREDNJI DIO","AVANT-DERNIÈRE SECTION INTERMÉDIAIRE","ちゅうばんせん","ΠΡΟΤΕΛΕΥΤΑΊΟ ΕΝΔΙΆΜΕΣΟ ΤΜΉΜΑ","PENULTIMATE INTERMEDIATE SECTION","PRIEKŠPĒDĒJĀ STARPPOSMA SEKCIJA","PRZEDOSTATNI ODCINEK POŚREDNI","PENÚLTIMA SECÇÃO INTERMÉDIA","PENULTIMA SECȚIUNE INTERMEDIARĂ","ПРЕДПОСЛЕДНЯЯ ПРОМЕЖУТОЧНАЯ СЕКЦИЯ","PREDPOSLEDNÁ PRIEBEŽNÁ ČASŤ","PREDZADNJI VMESNI DEL","PENÚLTIMA SECCIÓN INTERMEDIA","NÄST SISTA MELLANLIGGANDE AVSNITTET","VORLETZTER ZWISCHENABSCHNITT","SONDAN BIR ÖNCEKI ARA BÖLÜM","UTOLSÓ ELŐTTI KÖZÉPSŐ SZAKASZ"]
[321,"Trad321","SDOPPIAMENTO ","rozdělení","DEPLOYMENT","OPUSTI","Fractionnement","シェッド ","DEPLOYMENT","Splitting","SHED ","SHED ","Divisão","SHED ","SHED ","SHED ","SHED ","DEPARTAMENTO ","SHED ","ABTEILUNG ","SHED ","SHED "]
[322,{"$f":"+_xlfn.CONCAT(\"Trad\",A322)","v":"Trad322"},"CANCELLETTO DI SBARCO","PŘISTÁVACÍ BRÁNA","降落门","VRATA ZA SLJETANJE","PORTE D'EMBARQUEMENT","ランディングゲート","ΠΥΛΗ ΠΡΟΣΒΑΣΗΣ","LANDING GATE","IESNIEGŠANAS VĀRTI","BRAMA LĄDOWA","PORTA DE TERRA","POARTA DE ATERIZARE","ПОСАДОЧНЫЕ ВОРОТА","PRISTÁVACIA BRÁNA","VRATA ZA PRISTAJANJE","PUERTA DE ATERRIZAJE","LANDNINGSPORTER","LANDUNGSTOR","LANDİNG KAPISI","LANDING GATE"]
[323,"Trad323","FISSAGGIO SU LAMIERA","UPEVNĚNÍ NA PLECH","固定在金属板上","UČVRŠĆIVANJE NA LISTU","FIXATION SUR LA TÔLE","シートメタル固定","ΣΤΕΡΈΩΣΗ ΣΕ ΛΑΜΑΡΊΝΑ","FIXING ON SHEET METAL","STIPRINĀŠANA UZ LOKŠŅU METĀLA","MOCOWANIE NA BLASZE","FIXAÇÃO EM CHAPA METÁLICA","FIXARE PE TABLĂ","КРЕПЛЕНИЕ НА ЛИСТОВОЙ МЕТАЛЛ","UPEVNENIE NA PLECH","PRITRJEVANJE NA PLOČEVINO","FIJACIÓN EN CHAPA","FÄSTNING PÅ PLÅT","BEFESTIGUNG AUF BLECH","SAC METAL ÜZERINE SABITLEME","RÖGZÍTÉS FÉMLEMEZRE"]
[324,"Trad324","DOPPIA CHIUSURA","DVOJITÉ UZAVŘENÍ","双重闭合","DVOSTRUKO ZATVARANJE","DOUBLE FERMETURE","ダブルクロージャー","ΔΙΠΛΟ ΚΛΕΙΣΙΜΟ","DOUBLE CLOSURE","DUBULTĀ AIZVĒRŠANA","ZAMKNIĘCIE PODWÓJNE","FECHAMENTO DOUBULO","ÎNCHIDEREA DOUBLĂ","ДВОЙНОЕ ЗАКРЫТИЕ","DVOJITÉ ZATVORENIE","DVOJNO ZAPIRANJE","DOBLE CIERRE","DUBBEL STÄNGNING","DOPPELTER SCHLUSS","ÇİFT KAPALI","KETTŐS ZÁRÁS"]
[325,"Trad325","GRADINO DI USCITA","VÝCHOZÍ KROK","出口台阶","IZLAZNI KORAK","MARCHE DE SORTIE","退出ステップ","ΒΗΜΑ ΕΞΟΔΟΥ","EXIT STEP","IZEJAS PAKĀPIENS","KROK WYJŚCIOWY","PASSO DE SAÍDA","PASUL DE IEȘIRE","ВЫХОДНАЯ СТУПЕНЬКА","VÝCHODNÝ KROK","STOPNJA ZA IZHOD","ESCALÓN DE SALIDA","UTGÅNGSSTEG","AUSGANGSSTUFE","ÇIKIŞ ADIMI","EXIT LÉPÉS"]
[326,"Trad326","IMPERMEABILIZZAZIONE","VODOTĚSNÝ SYSTÉM","防水层","HIDROIZOLACIJA","IMPERMÉABILITÉ","ウォータープルーフ","ΥΔΡΟΣΤΑΣΙΑ","WATERPROOFING","ŪDENSNECAURLAIDĪGS PĀRKLĀJUMS","WODOODPORNOŚĆ","WATERPROOFING","HIDROIZOLAȚIE","ГИДРОИЗОЛЯЦИЯ","VODOHĽAD","VODOFILIRANJE","ESTANQUEIDAD","VATTENTÄTNING","WASSERABDICHTUNG","SU YALITIMI","VÍZÁLLÓSÍTÁS"]
[327,"Trad327","NUMERO DI ACCESSI","POČET PŘÍSTUPŮ","通道的数量","BROJ PRISTUPA","NOMBRE D'ACCÈS","アクセス数","ΑΡΙΘΜΌΣ ΠΡΟΣΒΆΣΕΩΝ","NUMBER OF ACCESSES","PIEKĻUVES VIETU SKAITS","LICZBA WEJŚĆ","NÚMERO DE ACESSOS","NUMĂR DE ACCESE","КОЛИЧЕСТВО ПОДЪЕЗДОВ","POČET PRÍSTUPOV","ŠTEVILO DOSTOPOV","NÚMERO DE ACCESOS","ANTAL INGÅNGAR","ANZAHL DER ZUGÄNGE","ERIŞIM SAYISI","BEJÁRATOK SZÁMA"]
[328,"Trad328","TRASPORTO E GESTIONE","DOPRAVA A SPRÁVA","运输和管理","PRIJEVOZ I MENADŽMENT","TRANSPORT ET GESTION","運輸・経営","ΜΕΤΑΦΟΡΆ ΚΑΙ ΔΙΑΧΕΊΡΙΣΗ","TRANSPORT AND MANAGEMENT","TRANSPORTĒŠANA UN PĀRVALDĪBA","TRANSPORT I ZARZĄDZANIE","TRANSPORTE E GESTÃO","TRANSPORT ȘI GESTIONARE","ТРАНСПОРТИРОВКА И УПРАВЛЕНИЕ","PREPRAVA A RIADENIE","PREVOZ IN UPRAVLJANJE","TRANSPORTE Y GESTIÓN","TRANSPORT OCH FÖRVALTNING","TRANSPORT UND VERWALTUNG","NAKLİYE VE YÖNETİM","SZÁLLÍTÁS ÉS KEZELÉS"]
[329,"Trad329","NASCONDI/SCOPRI CODICI","SKRÝT/ODKRÝT KÓDY"," 隐藏/不隐藏代码","SAKRIJ/OTKRIVAJ KODOVE","CACHER/DÉMASQUER LES CODES","コードの非表示／非表示を切り替える","ΑΠΌΚΡΥΨΗ/ΑΠΌΚΡΥΨΗ ΚΩΔΙΚΏΝ","HIDE/UNHIDE CODES","PASLĒPT/NOSLĒPT KODUS","UKRYJ/USUŃ KODY","OCULTAR/NÃO OCULTAR CÓDIGOS","ASCUNDE/DEZVĂLUIE CODURILE","СКРЫТЬ/ОТКРЫТЬ КОДЫ","SKRÝVANIE/ODKRÝVANIE KÓDOV","SKRIVANJE/ODKRIVANJE KOD","OCULTAR/DESOCULTAR CÓDIGOS","DÖLJA/AVLÄGSNA KODER","CODES AUSBLENDEN/EINBLENDEN","KODLARI GIZLE/GÖSTER","KÓDOK ELREJTÉSE/ELREJTÉSÉNEK MEGSZÜNTETÉSE"]
[330,"Trad330","Fine","Konec","结束","Kraj","Fin","終了","Τέλος","End","Beidzas","Koniec","Fim","Sfârșitul","Конец","Koniec","Konec","Fin","Slut","Ende","Bitiş","Vége"]
[331,"Trad331","Loop","Smyčka","循环","Petlja","Boucle","ループ","Βρόχος","Loop","Cilpa","Pętla","Loop","Bucla","Петля","Slučka","Zanka","Bucle","Slinga","Schleife","Döngü","Hurok"]
[332,"Trad332","Angolo","Úhel","角度","Kut","Angle","アングル","Γωνία","Angle","Leņķis","Kąt","Ângulo","Unghiul","Угол","Uhol","Kot","Ángulo","Vinkel","Winkel","Açı","Szög"]
[333,"Trad333","Coordinate","Souřadnice","坐标","Koordinate","Coordonnées","コーディネート","Συντεταγμένες","Coordinates","Koordinātas","Współrzędne","Coordenadas","Coordonate","Координаты","Súradnice","Koordinate","Coordenadas","Koordinater","Koordinaten","Koordinatlar","Koordináták"]
[334,"Trad334","Posizione Supporto #","Poloha Podpěra #","位置支持 #","Podrška za poziciju #","Position Support #","ポジションサポート #","Θέση Υποστήριξη #","Position Support #","Atrašanās vietas atbalsts #","Pozycja Wsparcie #","Posição de Apoio #","Poziția suportului #","Опора позиции #","Pozícia Podpora #","Položaj Podpora #","Posición Soporte #","Position Stöd #","Position Unterstützung #","Pozisyon Desteği #","Pozíció Támogatási #"]
[335,"Trad335","Partenza","Start","开始","Početak","Début","スタート","Έναρξη","Start","Sākums","Początek","Início","Start","Начало","Začiatok","Začetek","Inicio","Start","Start","Başlangıç","Start"]
[336,"Trad336","Partenza Condivisa","Sdílený začátek","共享的起点","Zajednički početak","Début partagé","シェアードスタート","Κοινή αρχή","Shared Start","Koplietošanas sākums","Wspólny początek","Início Partilhado","Shared Start","Общий старт","Spoločný začiatok","Skupni začetek","Inicio compartido","Delad start","Gemeinsamer Start","Paylaşımlı Başlangıç","Megosztott Start"]
[337,"Trad337","Da Supporto #","Od podpory #","从支座#开始","Od podrške #","Du support #","フロムサポート #","Από την Υποστήριξη #","From Support #","No atbalsta #","Od podpory #","Do Suporte #","De la Suport #","От опоры #","Od podpory #","Od podpore #","Desde apoyo #","Från stöd #","Von Auflager #","Destek'ten #","Támogatótól #"]
[338,"Trad338","A Supporto #","Do podpory #","至支撑点 #","Podržati #","Vers le support #","をサポートする。","Προς Υποστήριξη #","To Support #","Uz atbalstu #","Do Wspornika #","Para Apoiar #","Spre Suport #","К опоре #","Do podpory #","Do podpore #","Al soporte #","Till stöd #","Bis Stützpunkt #","Desteklemek için #","To Support #"]
[339,"Trad339","Direzione","Směr","方向","Smjer","Direction","ディレクション","Κατεύθυνση","Direction","Virziens","Kierunek","Sentido","Direcția","Направление","Smer","Smer","Dirección","Riktning","Richtung","Yön","Irány"]
[340,"Trad340","Lunghezza","Délka","长度","Duljina","Longueur","長さ","Μήκος","Lenght","Garums","Długość","Comprimento","Lungime","Длина","Dĺžka","Dolžina","Longitud","Längd","Länge","Uzunluk","Hosszúság"]
[341,"Trad341","Angolo°","Úhel°","角度","Kut°","Angle","角度","Γωνία°","Angle°","Leņķis°","Kąt°","Ângulo°","Unghiul","Угол°","Uhol°","Kot°","Ángulo","Vinkel°","Winkel°","Açı°","Szög°"]
[342,"Trad342","Lunghezza misurata","Naměřená délka","测量的长度","Izmjerena duljina","Longueur mesurée","測定された長さ","Μετρούμενο μήκος","Measured length","Izmērītais garums","Zmierzona długość","Comprimento medido","Lungime măsurată","Измеренная длина","Nameraná dĺžka","Izmerjena dolžina","Longitud medida","Uppmätt längd","Gemessene Länge","Ölçülen uzunluk","Mért hossz"]
[343,"Trad343","Partenza dall'ultimo","Začátek od posledního","从最后一个开始","Kreni od zadnjeg","Commencer par le dernier","最後からのスタート","Έναρξη από το τελευταίο","Start from Last","Sākums no pēdējā","Zacznij od ostatniego","Comece de Last","Începe de la ultimul","Начните с последней","Začiatok od posledného","Začetek od zadnjega","Empezar por el último","Börja från sista","Start von der letzten","Sondan Başla","Kezdet az utolsótól"]
[344,"Trad344","Attenzione al numero montanti","Věnujte pozornost počtu sloupků","注意立柱的数量","Obratite pozornost na broj stupova","Attention au nombre de montants","アップライトの本数に注目","Δώστε προσοχή στον αριθμό των ορθοστατών","Pay attention to the number of uprights","Pievērsiet uzmanību statņu skaitam","Zwróć uwagę na liczbę słupków","Preste atenção ao número de montantes","Fiți atenți la numărul de montanți","Обратите внимание на количество стоек","Venujte pozornosť počtu stĺpikov","Bodite pozorni na število stebričkov","Preste atención al número de montantes","Var uppmärksam på antalet stolpar","Achten Sie auf die Anzahl der Pfosten","Dikme sayısına dikkat edin","Figyeljen a függőleges oszlopok számára"]
[345,"Trad345","ZINCATO A CALDO","HORKÝ GALVANIZOVANÝ","热镀锌","TOPLO POCINČANO","GALVANISÉ CHAUD","ホットガルバニーズ","ΖΕΣΤΟΣ ΓΑΛΑΖΟΠΟΙΗΜΕΝΟΣ","HOT GALVANIZED","KARSTI GALVANIZĒTS","GALWANIZACJA GORĄCA","HOT GALVANIZADO","GALVANIZAT LA CALD","ГОРЯЧИЙ ГАЛЬВАНИЗИРОВАННЫЙ","HORÚCE GALVANIZOVANÉ","VROČA GALVANIZIRANA","GALVANIZADO EN CALIENTE","HOT GALVANIZED","HOT GALVANIZED","SICAK GALVANİZLİ","MELEG GALVANIZÁLT"]
[346,"Trad346","Arrivo e Ripartenza","Příjezd a opětovný start","到达和重启","Dolazak i ponovno pokretanje","Arrivée et redémarrage","到着と再スタート","Άφιξη και επανεκκίνηση","Arrival and Restart","Ierašanās un atkārtota iedarbināšana","Przyjazd i ponowny start","Chegada e reinício","Sosire și repornire","Прибытие и перезапуск","Príchod a opätovný štart","Prihod in ponovni zagon","Llegada y Reinicio","Ankomst och omstart","Ankunft und Neustart","Varış ve Yeniden Başlatma","Érkezés és újraindítás"]
[347,"Trad347","Esporta E-Service/Margin","Export E-Service/Margin","出口电子服务/利润率","Izvoz E-usluga/Marža","Exportation E-Service/Marge","輸出 電子サービス/マージン","Εξαγωγή E-Service/Περιθώριο","Export E-Service/Margin","Eksportēt e-pakalpojumu/maržu","Eksport E-Service/Marża","Exportar E-Service/Margin","Exportați E-Service/Margin","Экспорт E-Service/Margin","Export E-Service/Margin","Izvoz E-storitev/Marža","Exportación E-Service/Margen","Export E-Service/Margin","Export E-Service/Margin","İhracat E-Hizmet/Marjin","E-Service/Margin exportálása"]
[348,"Trad348","Terminali","Terminály","终端机","Terminali","Terminaux","端子類","Τερματικοί σταθμοί","Terminals","Termināli","Terminale","Terminais","Terminale","Терминалы","Terminály","Terminali","Terminales","Terminaler","Terminals","Terminaller","Terminálok"]
[349,"Trad349","Tutti i supporti","Všechny podpěry","所有的支架","Sve potpore","Tous les supports","すべてのサポート","Όλα τα στηρίγματα","All the supports","Visi balsti","Wszystkie podpory","Todos os apoios","Toate suporturile","Все опоры","Všetky podpery","Vsi nosilci","Todos los soportes","Alla stöd","Alle Stützen","Tüm destekler","Minden támasz"]
[350,"Trad350","n. supporti","č. Podporuje","没有。支架","Ne. Podržava","non. Supports","No. サポート内容","no. Υποστηρίζει","no. Supports","Nr. Atbalsta","nie. Podpory","não. Apoia","nu. Suporturi","нет. Опоры","č. Podporuje","ne. Podpira","no. Soportes","nr. Stöd","Nein. Stützen","Hayır. Destekler","nem. Támogatások"]
[351,"Trad351","Materiale Navetta","MATERIÁL RAKETOPLÁNU","梭子材料","MATERIJAL ZA SHUTTLE","MATÉRIEL DE LA NAVETTE","シャトル材","ΥΛΙΚΌ ΜΕΤΑΦΟΡΆΣ","SHUTTLE MATERIAL","TRANSPORTLĪDZEKLIS MATERIĀLS","MATERIAŁ CZÓŁENKOWY","MATERIAL DO VAIVÉM","MATERIAL DE NAVETĂ","ЧЕЛНОЧНЫЙ МАТЕРИАЛ","MATERIÁL ČLNA","MATERIAL ZA SHUTTLE","MATERIAL DE LANZADERA","MATERIAL FÖR SKYTTEL","SHUTTLE-MATERIAL","MEKIK MALZEMESI","INGAJÁRAT ANYAGA"]
[352,"Trad352","Copia Sconto","Kopírování Sleva","复制折扣","Kopiraj popust","Copie Remise","コピー割引","Αντίγραφο Έκπτωση","Copy Discount","Kopēt Atlaide","Kopia Rabat","Desconto por cópia","Reducere de copie","Копия Скидка","Zľava na kopírovanie","Kopiranje Popust","Copia Descuento","Kopiera rabatt","Kopieren Rabatt","Kopya İndirimi","Másolás Kedvezmény"]
[353,"Trad353","SISTEMA NON COMPLETO DEI TERMINALI","SYSTÉM NENÍ KOMPLETNÍ Z KONCŮ","系统不完整的两端","SUSTAV NIJE POTPUAN KRAJEVIMA","SYSTÈME NON COMPLET D'EXTRÉMITÉS","はんぱない","ΣΎΣΤΗΜΑ ΔΕΝ ΕΊΝΑΙ ΠΛΉΡΕΣ ΤΩΝ ΆΚΡΩΝ","SYSTEM NOT COMPLETE OF ENDS","SISTĒMA NAV PABEIGTA GALU","SYSTEM NIEKOMPLETNY KOŃCÓWKI","SISTEMA NÃO COMPLETO DE FINS","SISTEMUL NU ESTE COMPLET DE CAPETE","СИСТЕМА НЕ ЗАВЕРШЕНА КОНЦЫ","SYSTÉM NIE JE KOMPLETNÝ KONCOV","SISTEM NI POPOLN OD KONCEV","SISTEMA NO COMPLETO DE EXTREMOS","SYSTEMET ÄR INTE KOMPLETT AV ÄNDAR","SYSTEM NICHT VOLLSTÄNDIG VON ENDEN","SISTEM UÇLARI TAMAMLANMAMIŞ","RENDSZER NEM TELJES A VÉGEK"]
[354,"Trad354","X-LAM","CLT","CLT","CLT","CLT","シーエルティー","CLT","CLT","CLT","CLT","CLT","CLT","CLT","CLT","CLT","CLT","CLT","CLT","CLT","CLT"]
[355,"Trad355","CEMENTO ALVEOLARE","HOLLOW CORE","镂空芯材","ŠUPLJA JEZGRA","NOYAU CREUX","ホローコア","ΠΥΡΉΝΑΣ HOLLOW","HOLLOW CORE","HOLLOW CORE","RDZEŃ PŁASKI","HOLLOW CORE","HOLLOW CORE","ПУСТОТЕЛОЕ ЯДРО","HOLLOW CORE","HOLLOW CORE","NÚCLEO HUECO","HOLLOW CORE","HOLLOW CORE","HOLLOW CORE","HEGYES MAG"]
[356,"Trad356","LAMIERA TRAPEZOIDALE","TRAPÉZOVÝ PLECH","梯形板","TRAPEZOIDNI LIM","TÔLE TRAPÉZOÏDALE","台形シート","ΤΡΑΠΕΖΟΕΙΔΈΣ ΦΎΛΛΟ","TRAPEZOIDAL SHEET","TRAPECVEIDA LOKSNE","BLACHA TRAPEZOWA","FOLHA TRAPEZOIDAL","TABLĂ TRAPEZOIDALĂ","ТРАПЕЦИЕВИДНЫЙ ЛИСТ","TRAPÉZOVÝ PLECH","TRAPEZOIDNA PLOČEVINA","CHAPA TRAPEZOIDAL","TRAPEZOIDFORMAD PLÅT","TRAPEZFÖRMIGES BLECH","TRAPEZ SAC","TRAPÉZLEMEZ"]
[357,"Trad357","Spessori Minimi","Minimální tloušťky","最小厚度","Minimalne debljine","Epaisseurs minimales","最小厚み","Ελάχιστα πάχη","Minimum thicknesses","Minimālie biezumi","Minimalne grubości","Espessuras mínimas","Grosimi minime","Минимальные толщины","Minimálne hrúbky","Najmanjše debeline","Espesores mínimos","Minsta tjocklek","Mindeststärken","Minimum kalınlıklar","Minimális vastagságok"]
[358,"Trad358","METODO DI LAVORO","ZPŮSOB PRÁCE","工作方法","NAČIN RADA","MÉTHODE DE TRAVAIL","作業方法","ΜΕΘΟΔΟΣ ΕΡΓΑΣΙΑΣ","WORKING METHOD","DARBA METODE","METODA PRACY","MÉTODO DE TRABALHO","METODA DE LUCRU","МЕТОД РАБОТЫ","METÓDA PRÁCE","DELOVNA METODA","MÉTODO DE TRABAJO","ARBETSMETOD","ARBEITSWEISE","ÇALIŞMA YÖNTEMİ","MUNKAMÓD"]
[359,"Trad359","SOSPENSIONE ","PODPORA","悬吊","SUSPENZIJA","SUSPENSION","SUSPENSION","ΑΝΤΙΣΤΑΣΗ","SUSPENSION","PIEDZĪVES","PODSUMOWANIE","SUSPENSÃO","SUSPENSIE","УСПОКОЕНИЕ","PODPORA","IZVAJANJE","SUSPENSIÓN","FÄSTNING","SUSPENSION","SÜSPANSİYON","TÁMOGATÁS"]
[360,"Trad360","ANTICADUTA","ZACHYCENÍ PÁDU","防坠落装置","JESEN HAPŠENJE","ARRET DE CHUTE","FALL ARREST","ΠΤΩΣΗ ΑΡΙΣΤΕΡΑ","FALL ARREST","PĀRKRITUMA ATTURĒŠANA","ZATRZYMANIE PRZY UPADKU","ARRESTE DE CIMA","ARESTAREA CĂDERII","ЗАДЕРЖАНИЕ ПРИ ПАДЕНИИ","ZACHYTENIE PÁDU","ZAJEMANJE PRI PADAVANJU","DETENCIÓN DE CAÍDAS","FALLANSIKTER","FALLSICHERUNG","SONBAHAR TUTUKLAMASI","ZUHANÁS FELSZERELÉS"]
[361,"Trad361","TRATTENUTA","ZACHYCENÍ","救援","SUZDRŽAVANJE","RESTRAINT","RESTRAINT","ΑΣΦΑΛΙΣΗ","RESTRAINT","RESTRAINT","RESTRAINT","RESTRAINT","RESTRICȚIE","УДЕРЖАНИЕ","ZABEZPEČENIE","OHRANITEV","RESTRICCIÓN","RESTRAINT","RESTRAINT","RESTRAINT","FELSZABADÍTÁS"]
[362,"Trad362","Esterno","Vnější","外部","Vanjski","Externe","外部","Εξωτερικό","External","Ārējais","Zewnętrzna","Exterior","Extern","Внешний","Vonkajšie","Zunanji","Exterior","Extern","Außen","Harici","Külső"]
[363,"Trad363","Interno","Interní","内部","Interni","Interne","内部","Εσωτερική","Internal","Iekšējais","Wewnętrzne","Interno","Internă","Внутренняя","Interné","Notranji","Interno","Internt","Intern","Dahili","Belső"]
[364,"Trad364","DOPPIA APERTURA","DVOJITÉ OTEVŘENÍ","双开门","DVOSTRUKO OTVARANJE","DOUBLE OUVERTURE","ダブルオープニング","ΔΙΠΛΟ ΑΝΟΙΓΜΑ","DOUBLE OPENING","DUBULTĀ ATVĒRŠANA","PODWÓJNE OTWIERANIE","ABERTURA DOUBLE","DESCHIDERE DOUBLĂ","ДВОЙНОЕ ОТКРЫТИЕ","DVOJITÉ OTVORENIE","DVOJNO ODPRTJE","DOBLE APERTURA","DUBBLA ÖPPNINGAR","DOPPELTE ÖFFNUNG","ÇİFT AÇILIŞ","KETTŐS NYÍLÁS"]
[365,"Trad365","Posizione Etichetta","Označení polohy","位置标签","Oznaka položaja","Étiquette de position","ポジションラベル","Ετικέτα θέσης","Position Label","Pozīcijas marķējums","Etykieta pozycji","Etiqueta de posição","Eticheta poziției","Позиционная этикетка","Označenie polohy","Oznaka položaja","Posición etiqueta","Placering av etikett","Position Etikett","Pozisyon Etiketi","Pozíció címke"]
[366,"Trad366","Angolo Etichetta","Úhlový štítek","角度标签","Oznaka kuta","Etiquette d'angle","アングルラベル","Ετικέτα γωνίας","Angle Label","Leņķa etiķete","Etykieta kątowa","Etiqueta angular","Etichetă unghiulară","Угловая этикетка","Uhlový štítok","Oznaka kota","Etiqueta de ángulo","Etikett för vinkel","Winkel-Etikett","Açı Etiketi","Szögcímke"]
[367,"Trad367","CANCELLA DISEGNO","ODSTRANIT KRESBU","删除绘图","JASAN DIZAJN","SUPPRIMER LE DESSIN","ドローイングを削除する","ΔΙΑΓΡΑΦΗ ΣΧΕΔΙΑΣΜΟΥ","DELETE DRAWING","IZDZĒST ZĪMĒJUMU","USUŃ RYSUNEK","APAGAR DESENHO","ȘTERGEȚI DESENUL","УДАЛИТЬ ЧЕРТЕЖ","VYMAZAŤ KRESBU","IZBRISATI RISBO","SUPRIMIR DIBUJO","RADERA RITNINGEN","ZEICHNUNG LÖSCHEN","ÇİZİMİ SİL","DRAWING TÖRLÉSE"]
[368,"Trad368","Posizione Etichette","Polohové štítky","位置标签","Oznake položaja","Positionner les étiquettes","ポジションラベル","Τοποθέτηση ετικετών","Labels Position","Pozīcijas etiķetes","Pozycjonowanie Etykiety","Posição das etiquetas","Poziția etichetelor","Положение меток","Umiestnenie štítkov","Položaj nalepk","Posición etiquetas","Placering av etiketter","Aufkleber Position","Pozisyon Etiketler","Címkék pozíció"]
[369,"Trad369","fissaggi non inclusi","Fixings not included","Fixings not included","Fixings not included","Fixings not included","Fixings not included","Fixings not included","Fixings not included","Fixings not included","Fixings not included","Fixings not included","Fixings not included","Fixings not included","Fixings not included","Fixings not included","Fixings not included","Fixings not included","Fixings not included","Fixings not included","Fixings not included"]
[370,"Trad370","vite","screw","screw","screw","screw","screw","screw","screw","screw","screw","screw","screw","screw","screw","screw","screw","screw","screw","screw","screw"]
[371,"Trad371","bullone","bolt","bolt","bolt","bolt","bolt","bolt","bolt","bolt","bolt","bolt","bolt","bolt","bolt","bolt","bolt","bolt","bolt","bolt","bolt"]
[372,"Trad372","Stampa","Print","Print","Print","Print","Print","Print","Print","Print","Print","Print","Print","Print","Print","Print","Print","Print","Print","Print","Print"]
[373,"Trad373","Relazione Tecnica","Technical Report","Technical Report","Technical Report","Technical Report","Technical Report","Technical Report","Technical Report","Technical Report","Technical Report","Technical Report","Technical Report","Technical Report","Technical Report","Technical Report","Technical Report","Technical Report","Technical Report","Technical Report","Technical Report"]
[374,"Trad374",0]
[375,"Trad375",0]
[376,"Trad376",0]
[377,"Trad377",0]
[378,"Trad378",0]
[379,"Trad379",0]
[380,"Trad380",0]
[381,"Trad381",0]
[382,"Trad382",0]
[383,"Trad383",0]
[384,"Trad384",0]
[385,"Trad385",0]
[386,{"$f":"+_xlfn.CONCAT(\"Trad\",A386)","v":"Trad386"},0]
[387,"Trad387",0]
[388,"Trad388",0]
[389,"Trad389",0]
[390,"Trad390",0]
[391,"Trad391",0]
[392,"Trad392",0]
[393,"Trad393",0]
[394,"Trad394",0]
[395,"Trad395",0]
[396,"Trad396",0]
[397,"Trad397",0]
[398,"Trad398",0]
[399,"Trad399",0]
[400,"Trad400",0]
[401,"Trad401",0]
[402,"Trad402",0]
[403,"Trad403",0]
[404,"Trad404",0]
[405,"Trad405",0]
[406,"Trad406",0]
[407,"Trad407",0]
[408,"Trad408",0]
[409,"Trad409",0]
[410,"Trad410",0]
[411,"Trad411",0]
[412,"Trad412",0]
[413,"Trad413",0]
[414,"Trad414",0]
[415,"Trad415",0]
[416,"Trad416",0]
[417,"Trad417",0]
[418,"Trad418",0]
[419,"Trad419",0]
[420,"Trad420",0]
[421,"Trad421",0]
[422,"Trad422",0]
[423,"Trad423",0]
[424,"Trad424",0]
[425,"Trad425",0]
[426,"Trad426",0]
[427,"Trad427",0]
[428,"Trad428",0]
[429,"Trad429",0]
[430,"Trad430",0]
[431,"Trad431",0]
[432,"Trad432",0]
[433,"Trad433",0]
[434,"Trad434",0]
[435,"Trad435",0]
[436,"Trad436",0]
[437,"Trad437",0]
[438,"Trad438",0]
[439,"Trad439",0]
[440,"Trad440",0]
[441,"Trad441",0]
[442,"Trad442",0]
[443,"Trad443",0]
[444,"Trad444",0]
[445,"Trad445",0]
[446,"Trad446",0]
[447,"Trad447",0]
[448,"Trad448",0]
[449,"Trad449",0]
[450,{"$f":"+_xlfn.CONCAT(\"Trad\",A450)","v":"Trad450"},0]
[451,"Trad451",0]
[452,"Trad452",0]
[453,"Trad453",0]
[454,"Trad454",0]
[455,"Trad455",0]
[456,"Trad456",0]
[457,"Trad457",0]
[458,"Trad458",0]
[459,"Trad459",0]
[460,"Trad460",0]
[461,"Trad461",0]
[462,"Trad462",0]
[463,"Trad463",0]
[464,"Trad464",0]
[465,"Trad465",0]
[466,"Trad466",0]
[467,"Trad467",0]
[468,"Trad468",0]
[469,"Trad469",0]
[470,"Trad470",0]
[471,"Trad471",0]
[472,"Trad472",0]
[473,"Trad473",0]
[474,"Trad474",0]
[475,"Trad475",0]
[476,"Trad476",0]
[477,"Trad477",0]
[478,"Trad478",0]
[479,"Trad479",0]
[480,"Trad480",0]
[481,"Trad481",0]
[482,"Trad482",0]
[483,"Trad483",0]
[484,"Trad484",0]
[485,"Trad485",0]
[486,"Trad486",0]
[487,"Trad487",0]
[488,"Trad488",0]
[489,"Trad489",0]
[490,"Trad490",0]
[491,"Trad491",0]
[492,"Trad492",0]
[493,"Trad493",0]
[494,"Trad494",0]
[495,"Trad495",0]
[496,"Trad496",0]
[497,"Trad497",0]
[498,"Trad498",0]
[499,"Trad499",0]
[500,"Trad500",0]
[501,"Trad501",0]
[502,"Trad502",0]
[503,"Trad503",0]
[504,"Trad504",0]
[505,"Trad505",0]
[506,"Trad506",0]
[507,"Trad507",0]
[508,"Trad508",0]
[509,"Trad509",0]
[510,"Trad510",0]
[511,"Trad511",0]
[512,"Trad512",0]
[513,"Trad513",0]
[514,{"$f":"+_xlfn.CONCAT(\"Trad\",A514)","v":"Trad514"},0]
[515,"Trad515",0]
[516,"Trad516",0]
[517,"Trad517",0]
[518,"Trad518",0]
[519,"Trad519",0]
[520,"Trad520",0]
[521,"Trad521",0]
[522,"Trad522",0]
[523,"Trad523",0]
[524,"Trad524",0]
[525,"Trad525",0]
[526,"Trad526",0]
[527,"Trad527",0]
[528,"Trad528",0]
[529,"Trad529",0]
[530,"Trad530",0]
[531,"Trad531",0]
[532,"Trad532",0]
[533,"Trad533",0]
[534,"Trad534",0]
[535,"Trad535",0]
[536,"Trad536",0]
[537,"Trad537",0]
[538,"Trad538",0]
[539,"Trad539",0]
[540,"Trad540",0]
[541,"Trad541",0]
[542,"Trad542",0]
[543,"Trad543",0]
[544,"Trad544",0]
[545,"Trad545",0]
[546,"Trad546",0]
[547,"Trad547",0]
[548,"Trad548",0]
[549,"Trad549",0]
[550,"Trad550",0]
[551,"Trad551",0]
[552,"Trad552",0]
[553,"Trad553",0]
[554,"Trad554",0]
[555,"Trad555",0]
[556,"Trad556",0]
[557,"Trad557",0]
[558,"Trad558",0]
[559,"Trad559",0]
[560,"Trad560",0]
[561,"Trad561",0]
[562,"Trad562",0]
[563,"Trad563",0]
[564,"Trad564",0]
[565,"Trad565",0]
[566,"Trad566",0]
[567,"Trad567",0]
[568,"Trad568",0]
[569,"Trad569",0]
[570,"Trad570",0]
[571,"Trad571",0]
[572,"Trad572",0]
[573,"Trad573",0]
[574,"Trad574",0]
[575,"Trad575",0]
[576,"Trad576",0]
[577,"Trad577",0]
[578,{"$f":"+_xlfn.CONCAT(\"Trad\",A578)","v":"Trad578"},0]
[579,"Trad579",0]
[580,"Trad580",0]
[581,"Trad581",0]
[582,"Trad582",0]
[583,"Trad583",0]
[584,"Trad584",0]
[585,"Trad585",0]
[586,"Trad586",0]
[587,"Trad587",0]
[588,"Trad588",0]
[589,"Trad589",0]
[590,"Trad590",0]
[591,"Trad591",0]
[592,"Trad592",0]
[593,"Trad593",0]
[594,"Trad594",0]
[595,"Trad595",0]
[596,"Trad596",0]
[597,"Trad597",0]
[598,"Trad598",0]
[599,"Trad599",0]
[600,"Trad600",0]
[601,"Trad601","Calcolo del sistema linea vita \"PATROL\"","VÝPOČET ZÁCHRANNÉ LINIE HLÍDKY","巡逻生命线计算","Proračun sustava za spašavanje \"PATROL\".","CALCUL DE LA LIGNE DE VIE \"PATROL\"",null,null,"PATROL LIFE LINE CALCULATOR",null,null,"Cálculo do sistema de linhas de vida PATROL",{"$nulls":4},"Cálculo del sistema de línea de vida \"PATROL",null,"PATROL\"-Rettungsleinen-Systemberechnung"]
[602,"Trad602","Forze e deformazione del sistema","Síly a deformace systému","系统受力和变形","Sile i deformacije sustava","Forces et déformations du système",null,null,"Forces and deflection of the system",null,null,"Forças e deformações do sistema",{"$nulls":4},"Fuerzas y deformaciones del sistema",null,"Systemkräfte und Verformung"]
[603,"Trad603","Assorbitore-tensionatore","Absorber-tensioner","吸收器-拉力器","Apsorber-zatezač","Absorbeur-tendeur",null,null,"Assorber-Tensioner",null,null,"Absorvedor-tensor",{"$nulls":4},"Absorbedor-tensor",null,"Absorber-Spannvorrichtung"]
[604,"Trad604","Non è consigliabile avere una linea di vita con angoli inferiori a 90°. In questi casi, si raccomanda di dividere la linea di vita in quel punto.","Nedoporučuje se mít záchranné lano s úhly menšími než 90°. V takových případech se doporučuje záchranné lano v tomto bodě rozdělit.","生命线的角度小于90°是不可取的。在这种情况下，建议在该点上拆分救生绳。","Ne preporučuje se imati uže za spašavanje s kutovima manjim od 90°. U tim slučajevima preporuča se razdvojiti pojas za spašavanje na tom mjestu.","Il est déconseillé d'avoir une ligne de vie avec des angles inférieurs à 90°. Dans ce cas, il est recommandé de diviser la ligne de vie à cet endroit.",null,null,"It is not recommended to have a lifeline with angles of less than 90°. In such cases, it is recommended to split the lifeline at that point.",null,null,"Não é aconselhável ter uma linha de vida com ângulos inferiores a 90°. Nestes casos, recomenda-se que a linha de vida seja dividida nesse ponto.",{"$nulls":4},"No es aconsejable tener una línea de vida con ángulos inferiores a 90°. En tales casos, se recomienda dividir la línea de vida en ese punto.",null,"Es ist nicht ratsam, eine Rettungsleine mit einem Winkel von weniger als 90° zu verwenden. In solchen Fällen empfiehlt es sich, die Laufsicherung an dieser Stelle zu teilen."]
[605,"Trad605","Numero max di utenti","Maximální počet uživatelů","最大用户数","Maksimalan broj korisnika","Nombre maximal d'utilisateurs",null,null,"Max number of users",null,null,"Número máximo de utilizadores",{"$nulls":4},"Número máximo de usuarios",null,"Max. Anzahl der Benutzer"]
[606,"Trad606","Carichi da manuale di installazione (EN795)","Zatížení podle instalační příručky (EN795)","按照安装手册（EN795）规定的载荷","Učitava se iz priručnika za instalaciju (EN795)","Charges selon le manuel d'installation (EN795)",null,null,"Installation manual loads (EN795)",null,null,"Cargas de acordo com o manual de instalação (EN795)",{"$nulls":4},"Cargas según manual de instalación (EN795)",null,"Belastungen gemäß Montageanleitung (EN795)"]
[607,"Trad607","Interasse","Středová vzdálenost","中心距离","Međuosovinski razmak","Entraxe",null,null,"Span",null,null,"Distância central",{"$nulls":4},"Distancia entre ejes",null,"Achsabstand"]
[608,"Trad608","Flessione massima Cavo","Maximální průhyb Lano","最大挠度 电缆","Maksimalno savijanje kabela","Déviation maximale Câble",null,null,"Max Deflection Cable",null,null,"Deflexão máxima Cabo",{"$nulls":4},"Desviación máxima Cable",null,"Maximale Durchbiegung Seil"]
[609,"Trad609","Fmax","Fmax","Fmax","Fmax","Fmax",null,null,"Fmax",null,null,"Fmax",{"$nulls":4},"Fmax",null,"Fmax"]
[610,"Trad610","Lunghezza massima campata","Maximální délka rozpětí","最大跨度长度","Maksimalna duljina raspona","Longueur maximale de la travée",null,null,"Max length span",null,null,"Comprimento máximo do vão",{"$nulls":4},"Longitud máxima del vano",null,"Maximale Länge der Spannweite"]
[611,"Trad611","Carico applicato alla campata all'interno di questo segmento","Zatížení působící na rozpětí v tomto segmentu","在此段内应用于跨度的载荷","Opterećenje primijenjeno na raspon unutar ovog segmenta","Charge appliquée à la portée à l'intérieur de ce segment",null,null,"Load applied on span within this segment",null,null,"Carga aplicada ao vão dentro deste segmento",{"$nulls":4},"Carga aplicada al vano dentro de este segmento",null,"Auf die Spannweite innerhalb dieses Segments wirkende Last"]
[612,"Trad612","Reazione sugli elementi di ancoraggio della fune a più campate","Reakce na kotevní prvky lana ve více rozpětích","多跨绳索锚固件上的反作用力","Reakcija na elemente sidrenja višerasponskog užeta","Réaction sur les éléments d'ancrage de câbles à travées multiples",null,null,"Reaction on anchor elements of the multi-span rope",null,null,"Reacção em elementos de ancoragem de cabos com vários vãos",{"$nulls":4},"Reacción en elementos de anclaje de cable de varios vanos",null,"Reaktion auf mehrfeldrige Seilverankerungselemente"]
[613,"Trad613","Curva","Křivka","曲线","Zavoj","Courbe",null,null,"Curve",null,null,"Curva",{"$nulls":4},"Curva",null,"Kurve"]
[614,"Trad614","Carico massimo di progetto","Maximální návrhové zatížení","最大设计载荷","Maksimalno proračunsko opterećenje","Charge maximale de conception",null,null,"Max design load",null,null,"Carga máxima de projecto",{"$nulls":4},"Carga máxima de diseño",null,"Maximale Bemessungslast"]
[615,"Trad615","Freccia della fune della campata rispetto ai vincoli delle estremità di giunzione","Křivka rozpětí lana ve vztahu k omezením konců spojů","跨度绳索的曲线与连接端约束的关系","Otklon rasponskog užeta u odnosu na ograničenja kraja spoja","Courbe du câble de la travée par rapport aux contraintes des extrémités de l'épissure",null,null,"Span rope deflection with respect to joining end constraints",null,null,"Curva do cabo do vão em relação às restrições das extremidades das emendas",{"$nulls":4},"Curva de la cuerda del vano en relación con las limitaciones de los extremos de empalme",null,"Kurve des Spannseils in Bezug auf die Zwänge der Spleißenden"]
[616,"Trad616","Campata caricata","Zatížené rozpětí","受载跨度","Zaljev natovaren","Portée chargée",null,null,"Loaded Span",null,null,"Vão carregado",{"$nulls":4},"Vano cargado",null,"Belastete Spannweite"]
[617,"Trad617","Freccia","Šipka","箭头","Strijela","Flèche",null,null,"Deflection ",null,null,"Seta",{"$nulls":4},"Flecha",null,"Pfeil"]
[618,"Trad618","Modulo","Modul","模块","Modul","Module",null,null,"Module",null,null,"Módulo",{"$nulls":4},"Módulo",null,"Modul"]
[619,"Trad619"," m per l'allungamento della fune già considerato"," m pro již uvažované prodloužení lana"," 米，为已经考虑的绳索伸长率","  m za već razmatrano produljenje užeta"," m pour l'allongement du câble déjà pris en compte",null,null," m for rope elongation already considered",null,null," m para o alongamento do cabo já considerado",{"$nulls":4}," m para el alargamiento de la cuerda ya considerado",null," m für die bereits berücksichtigte Seildehnung"]
[620,"Trad620","Non è consigliabile avere una linea di vita con angoli inferiori a 90°. In questi casi, si raccomanda di dividere la linea di vita in quel punto.","Není vhodné mít záchranné lano s úhly menšími než 90°. V takových případech se doporučuje záchranné lano v tomto bodě rozdělit.","角度小于90°的生命线是不可取的。在这种情况下，建议在这一点上对生命线进行分割。","Ne preporučuje se imati uže za spašavanje s kutovima manjim od 90°. U tim slučajevima preporuča se razdvojiti pojas za spašavanje na tom mjestu.","Il est déconseillé d'avoir une ligne de vie avec des angles inférieurs à 90°. Dans ce cas, il est recommandé de diviser la ligne de vie à cet endroit.",null,null,"It is not recommended to have a lifeline with angles of less than 90°. In such cases, it is recommended to split the lifeline at that point.",null,null,"Não é aconselhável ter uma linha de vida com ângulos inferiores a 90°. Nestes casos, recomenda-se a divisão da linha de vida nesse ponto.",{"$nulls":4},"No es aconsejable tener una línea de vida con ángulos inferiores a 90°. En tales casos, se recomienda dividir la línea de vida en ese punto.",null,"Es ist nicht ratsam, eine Rettungsleine mit Winkeln von weniger als 90° zu verwenden. In solchen Fällen empfiehlt es sich, die Rettungsleine an dieser Stelle zu teilen."]
[621,"Trad621","Disegnare i segmenti della linea di vita","Kreslení segmentů záchranného lana","绘制救生绳段","Nacrtajte segmente linije života","Dessin des segments de la ligne de vie",null,null,"Draw the segments of your life line",null,null,"Desenho dos segmentos da linha de vida",{"$nulls":4},"Trazado de los segmentos de la línea de vida",null,"Zeichnen der Rettungsleinenabschnitte"]
[622,"Trad622","I fissaggi e gli ancoraggi devono essere gli stessi in tutti i punti di ancoraggio.","Upevnění a kotvení musí být ve všech kotevních bodech stejné.","所有锚点的固定和锚固必须相同。","Pričvršćivači i sidra moraju biti isti na svim sidrištima.","Les fixations et les ancrages doivent être identiques à tous les points d'ancrage.",null,null,"Fixings and anchors must be the same in all anchor points.",null,null,"As fixações e as ancoragens devem ser as mesmas em todos os pontos de ancoragem.",{"$nulls":4},"Las fijaciones y anclajes deben ser los mismos en todos los puntos de anclaje.",null,"Die Befestigungen und Verankerungen müssen an allen Verankerungspunkten identisch sein."]
[623,"Trad623","Prima della costruzione, tutti i calcoli devono essere verificati e approvati dal progettista responsabile.","Před zahájením stavby musí být všechny výpočty ověřeny a schváleny odpovědným projektantem.","在施工前，所有的计算都必须经过负责任的设计师的核实和批准。","Prije izgradnje sve proračune mora ovjeriti i odobriti odgovorni projektant.","Avant la construction, tous les calculs doivent être vérifiés et approuvés par le concepteur responsable.",null,null,"Before the construction, all calculation must be verified and approved by the responsible designer.",null,null,"Antes da construção, todos os cálculos devem ser verificados e aprovados pelo projectista responsável.",{"$nulls":4},"Antes de la construcción, todos los cálculos deben ser verificados y aprobados por el diseñador responsable.",null,"Vor dem Bau müssen alle Berechnungen vom zuständigen Konstrukteur überprüft und genehmigt werden."]
[624,"Trad624","NOTE","POZNÁMKY","注意事项","BILJEŠKA","NOTES",null,null,"NOTES",null,null,"NOTAS",{"$nulls":4},"NOTAS",null,"ANMERKUNGEN"]
[625,"Trad625","I valori di resistenza meccanica e la geometria si riferiscono alla certificazione del prodotto.","Hodnoty mechanické odolnosti a geometrie se vztahují k certifikaci výrobku.","机械阻力值和几何形状参考产品认证。","Vrijednosti mehaničke otpornosti i geometrija odnose se na certifikaciju proizvoda.","Les valeurs de résistance mécanique et la géométrie se réfèrent à la certification du produit.",null,null,"Mechanical resistance values and geometry refer to product certification.",null,null,"Os valores de resistência mecânica e a geometria referem-se à certificação do produto.",{"$nulls":4},"Los valores de resistencia mecánica y la geometría se refieren a la certificación del producto.",null,"Die Werte für die mechanische Festigkeit und die Geometrie beziehen sich auf die Produktzertifizierung."]
[626,"Trad626","La verifica della resistenza dei sistemi di ancoraggio deve essere realizzata a parte.","Ověření pevnosti kotevních systémů musí být provedeno samostatně.","锚固系统的强度验证必须单独进行。","Provjera čvrstoće sustava za sidrenje mora se provesti zasebno.","La vérification de la résistance des systèmes d'ancrage doit être effectuée séparément.",null,null,"Verification of anchoring systems resistance must be realized apart.",null,null,"A verificação da resistência dos sistemas de ancoragem deve ser efectuada separadamente.",{"$nulls":4},"La verificación de la resistencia de los sistemas de anclaje debe realizarse por separado.",null,"Der Nachweis der Festigkeit der Verankerungssysteme ist gesondert zu erbringen."]
[627,"Trad627","Tutti i calcoli devono essere verificati e approvati dal progettista responsabile prima dell'esecuzione. Il progettista è tenuto a verificare, ad ogni utilizzo, la conformità dei dati alle normative vigenti e al progetto. La responsabilità ultima della scelta del prodotto appropriato per una specifica applicazione spetta al progettista.","Všechny výpočty musí být před realizací ověřeny a schváleny odpovědným projektantem. Projektant je odpovědný za ověření shody údajů s platnými předpisy a za návrh při každém použití. Konečnou odpovědnost za výběr vhodného výrobku pro konkrétní použití nese projektant.","所有的计算结果必须在执行前由负责的设计师进行核实和批准。设计者负责验证数据是否符合适用的规定，以及设计是否符合每一种用途。为特定的应用选择合适的产品的最终责任在于设计师。","Sve proračune prije izvođenja mora ovjeriti i odobriti odgovorni projektant. Projektant je dužan pri svakoj uporabi provjeriti usklađenost podataka s važećim propisima i projektom. Konačna odgovornost za odabir odgovarajućeg proizvoda za određenu primjenu leži na dizajneru.","Tous les calculs doivent être vérifiés et approuvés par le concepteur responsable avant l'exécution. Le concepteur est responsable de la vérification de la conformité des données avec les réglementations applicables et de la conception avec chaque utilisation. La responsabilité finale de la sélection du produit approprié pour une application spécifique incombe au concepteur.",null,null,"All calculations must be verified and approved by the responsible designer prior to execution. The designer are responsible to verify, at each use, the conformity of the data to the regulations in force and to the project. The ultimate responsibility for choosing the appropriate product for a specific application lies with the designer.",null,null,"Todos os cálculos devem ser verificados e aprovados pelo projectista responsável antes da execução. O projectista é responsável por verificar a conformidade dos dados com os regulamentos aplicáveis e o projecto com cada utilização. A responsabilidade final pela selecção do produto adequado para uma aplicação específica cabe ao projectista.",{"$nulls":4},"Todos los cálculos deben ser verificados y aprobados por el proyectista responsable antes de la ejecución. El proyectista es responsable de verificar la conformidad de los datos con la normativa aplicable y del diseño con cada uso. La responsabilidad última de la selección del producto adecuado para una aplicación específica recae en el proyectista.",null,"Alle Berechnungen müssen vor der Ausführung durch den verantwortlichen Planer überprüft und genehmigt werden. Der Planer ist dafür verantwortlich, die Konformität der Daten mit den geltenden Vorschriften und der Konstruktion bei jeder Verwendung zu überprüfen. Die endgültige Verantwortung für die Auswahl des geeigneten Produkts für eine bestimmte Anwendung liegt beim Planer."]
[628,"Trad628","I risultati ottenuti in questa scheda sono di natura indicativa e vanno considerati come un servizio tecnico-commerciale nell'ambito dell'attività di vendita di Rotho Blaas srl. Il numero e lo spessore degli inserti devono essere determinati dal progettista responsabile che è tenuto a verificare l'esattezza dei risultati derivanti dall'elaborazione dei dati inseriti. Rotho Blaas srl non garantisce la conformità alla normativa vigente e la progettazione dei calcoli effettuati tramite questo foglio di calcolo. In particolare, in seguito alla modifica delle disposizioni pertinenti, quali ad esempio norme, approvazioni, ecc. il programma potrebbe diventare, in parte o in toto, non valido. Rotho Blaas srl non garantisce e non sarà responsabile per danni o conseguenze dirette o indirette o altro, in qualsiasi modo (garanzia per difetti, garanzia per malfunzionamento, responsabilità del prodotto o legale, ecc.) L'Utente dichiara di utilizzare il foglio di calcolo in qualità di professionista con l'obbligo e la responsabilità di verificare che il foglio di calcolo risponda alle sue specifiche esigenze.","Výsledky získané v tomto listu mají orientační charakter a je třeba je považovat za technicko-obchodní službu v rámci prodejní činnosti společnosti Rotho Blaas srl. Počet a tloušťku vložek musí určit odpovědný projektant, který je povinen ověřit správnost získaných výsledků zpracováním zadaných údajů. Společnost Rotho Blaas srl neručí za soulad s platnými předpisy a za provedení výpočtů provedených pomocí této tabulky. Zejména v důsledku změn příslušných předpisů, jako jsou normy, schválení atd. může program částečně nebo zcela pozbýt platnosti. Společnost Rotho Blaas s.r.o. nezaručuje a neodpovídá za žádné přímé ani nepřímé škody nebo následky (záruka za vady, záruka za nefunkčnost, odpovědnost za výrobek nebo právní odpovědnost atd. Uživatel prohlašuje, že tabulkový procesor používá jako profesionál s povinností a odpovědností ověřit, zda tabulkový procesor splňuje jeho konkrétní požadavky.","本表中获得的结果是指示性的，应视为Rotho Blaas srl公司销售活动中的一项技术-商业服务。嵌入物的数量和厚度必须由负责的设计师决定，他有义务通过处理输入的数据来验证所获得的结果的准确性。Rotho Blaas srl公司不保证使用本电子表格进行的计算符合现行法规和设计。特别是，由于相关法规的变化，如标准、批准等，该方案可能部分或全部无效。Rotho Blaas有限公司不保证也不对任何直接或间接的损害或后果负责（缺陷保证、故障保证、产品或法律责任等）。 用户声明他/她是作为专业人士使用该电子表格，有义务和责任验证该电子表格是否符合他/她的具体要求。","Rezultati dobiveni u ovoj tablici indikativne su prirode i trebaju se smatrati tehničko-komercijalnom uslugom u okviru prodajne aktivnosti tvrtke Rotho Blaas srl. Broj i debljinu umetaka mora odrediti odgovorni projektant koji je dužan provjeriti točnost rezultata obrade unesenih podataka. Rotho Blaas srl ne jamči usklađenost s važećim zakonima i dizajnom izračuna napravljenih pomoću ove proračunske tablice. Konkretno, nakon izmjene relevantnih odredbi, kao što su na primjer standardi, odobrenja itd. program može postati, u cijelosti ili djelomično, nevažeći. Rotho Blaas srl ne jamči i neće biti odgovoran za štete ili izravne ili neizravne posljedice ili na bilo koji drugi način, na bilo koji način (jamstvo za nedostatke, jamstvo za kvarove, proizvod ili pravna odgovornost, itd.). Korisnik izjavljuje da koristi proračunsku tablicu kao profesionalac s obvezom i odgovornošću provjeriti zadovoljava li proračunska tablica vaše specifične potrebe.","Les résultats obtenus dans cette fiche ont un caractère indicatif et doivent être considérés comme un service technico-commercial dans le cadre de l'activité commerciale de Rotho Blaas srl. Le nombre et l'épaisseur des inserts doivent être déterminés par le concepteur responsable, qui est tenu de vérifier l'exactitude des résultats obtenus en traitant les données introduites. Rotho Blaas srl ne garantit pas la conformité aux normes en vigueur et la conception des calculs effectués à l'aide de cette feuille de calcul. En particulier, à la suite de changements dans les réglementations pertinentes, telles que les normes, les approbations, etc., le programme peut devenir invalide en partie ou en totalité. Rotho Blaas Ltd. ne garantit pas et n'est pas responsable des dommages ou conséquences directs ou indirects quels qu'ils soient (garantie pour les défauts, garantie pour les dysfonctionnements, responsabilité du fait des produits ou responsabilité juridique, etc. L'utilisateur déclare qu'il utilise le tableur en tant que professionnel avec l'obligation et la responsabilité de vérifier que le tableur répond à ses besoins spécifiques.",null,null,"The results obtained in this sheet are of an indicative nature and should be considered as a technical-commercial service within the Rotho Blaas srl sales activity. The number and thickness of the inserts must be determined by the responsible designer who is required to check the accuracy of the results deriving from the processing of the data entered. Rotho Blaas srl does not guarantee compliance with current legislation and the design of the calculations made through this spreadsheet. In particular, following the amendment of the pertinent provisions such as, for example standards, approvals, etc. the program may become, in part or in whole, invalid. Rotho Blaas srl does not guarantee and will not be responsible for direct or indirect damages or consequences or other, in any way (warranty for defects, warranty for malfunction, product or legal responsibility, etc.). The User declares to use the spreadsheet as a professional with the obligation and responsibility to verify that the spreadsheet meets his specific needs.",null,null,"Os resultados obtidos nesta ficha são de natureza indicativa e devem ser considerados como um serviço técnico-comercial no âmbito da actividade comercial da Rotho Blaas srl. O número e a espessura das inserções devem ser determinados pelo projectista responsável, que tem a obrigação de verificar a exactidão dos resultados obtidos através do tratamento dos dados introduzidos. Rotho Blaas srl não garante a conformidade com a regulamentação em vigor e a concepção dos cálculos efectuados com esta folha de cálculo. Em particular, devido a alterações nas normas aplicáveis, tais como normas, aprovações, etc., o programa pode tornar-se inválido em parte ou na totalidade. A Rotho Blaas Ltd. não garante e não será responsável por qualquer dano ou consequência directa ou indirecta (garantia de defeitos, garantia de mau funcionamento, responsabilidade pelo produto ou legal, etc.). O utilizador declara que está a utilizar a folha de cálculo como profissional, com a obrigação e a responsabilidade de verificar se a folha de cálculo satisfaz as suas necessidades específicas.",{"$nulls":4},"Los resultados obtenidos en esta ficha son de carácter indicativo y deben considerarse como un servicio técnico-comercial dentro de la actividad de venta de Rotho Blaas srl. El número y el espesor de los insertos deben ser determinados por el proyectista responsable, que está obligado a verificar la exactitud de los resultados obtenidos mediante el tratamiento de los datos introducidos. Rotho Blaas srl no garantiza la conformidad con la normativa vigente y el diseño de los cálculos realizados con esta hoja de cálculo. En particular, como consecuencia de cambios en la normativa aplicable, como normas, homologaciones, etc., el programa puede perder validez total o parcial. Rotho Blaas Ltd. no garantiza y no será responsable de ningún daño o consecuencia directa o indirecta (garantía por defectos, garantía por mal funcionamiento, responsabilidad legal o del producto, etc.) El usuario declara que utiliza la hoja de cálculo como profesional con la obligación y responsabilidad de verificar que la hoja de cálculo cumple sus requisitos específicos.",null,"Die in diesem Blatt enthaltenen Ergebnisse sind Richtwerte und sind als technisch-kommerzieller Service im Rahmen der Verkaufstätigkeit der Rotho Blaas srl zu betrachten. Die Anzahl und die Dicke der Einlagen müssen vom verantwortlichen Planer festgelegt werden, der verpflichtet ist, die Richtigkeit der durch die Verarbeitung der eingegebenen Daten erhaltenen Ergebnisse zu überprüfen. Rotho Blaas srl übernimmt keine Garantie für die Übereinstimmung der mit dieser Tabelle durchgeführten Berechnungen mit den geltenden Vorschriften und der Konstruktion. Insbesondere kann das Programm aufgrund von Änderungen der einschlägigen Vorschriften, wie Normen, Zulassungen usw., ganz oder teilweise ungültig werden. Die Rotho Blaas AG übernimmt keine Garantie und haftet nicht für direkte oder indirekte Schäden oder Folgen (Mängelhaftung, Garantie für Fehlfunktionen, Produkt- oder Rechtshaftung usw.) Der Benutzer erklärt, dass er das Tabellenblatt als Fachmann verwendet und verpflichtet ist, zu überprüfen, ob das Tabellenblatt seinen spezifischen Anforderungen entspricht."]
[629,"Trad629","ancoraggi alla campata caricata","anchors at the loaded span","anchors at the loaded span","sidra na opterećeni raspon","ancrages à la portée chargée","anchors at the loaded span","anchors at the loaded span","anchors at the loaded span","anchors at the loaded span","anchors at the loaded span","anchors at the loaded span","anchors at the loaded span","anchors at the loaded span","anchors at the loaded span","anchors at the loaded span","anclajes al vano con carga","anchors at the loaded span","Verankerungen an der belasteten Spannweite","anchors at the loaded span","anchors at the loaded span"]
[630,"Trad630","ancoraggi alla campata non caricata","anchors at the unloaded span","anchors at the unloaded span","sidra za neopterećeni raspon","ancrages à la portée non chargée","anchors at the unloaded span","anchors at the unloaded span","anchors at the unloaded span","anchors at the unloaded span","anchors at the unloaded span","anchors at the unloaded span","anchors at the unloaded span","anchors at the unloaded span","anchors at the unloaded span","anchors at the unloaded span","anclajes al vano sin carga","anchors at the unloaded span","Verankerungen an der unbelasteten Spannweite","anchors at the unloaded span","anchors at the unloaded span"]
[631,"Trad631","Intermedio Tratto","Last Intermediate","Last Intermediate","Zadnji posrednik","Intermédiaire du segment","Last Intermediate","Last Intermediate","Intermediate of segment","Last Intermediate","Last Intermediate","Last Intermediate","Last Intermediate","Last Intermediate","Last Intermediate","Last Intermediate","Intermedio de segmento","Last Intermediate","Zwischenprodukt des Segments","Last Intermediate","Last Intermediate"]
[632,"Trad632","Termine la linea vita con Fine o Loop","End the lifeline with End or Loop","End the lifeline with End or Loop","Završite pojas za spašavanje pomoću Fino ili Loop","Terminer la ligne de vie avec End ou Loop","End the lifeline with End or Loop","End the lifeline with End or Loop","End the lifeline with End or Loop","End the lifeline with End or Loop","End the lifeline with End or Loop","End the lifeline with End or Loop","End the lifeline with End or Loop","End the lifeline with End or Loop","End the lifeline with End or Loop","End the lifeline with End or Loop","Fin de línea de vida con extremo o bucle","End the lifeline with End or Loop","Ende der Rettungsleine mit Ende oder Schleife","End the lifeline with End or Loop","End the lifeline with End or Loop"]
[633,"Trad633","sul Desktop",{"$nulls":3},"sur le ordinateur de bureau",null,null,"on the Desktop",{"$nulls":7},"en el escritorio",null,"Auf dem Bildschirm"]
[634,"Trad634"]
[635,"Trad635"]
[636,"Trad636"]
[637,"Trad637"]
[638,"Trad638"]
[639,"Trad639"]
[640,"Trad640"]
[641,"Trad641"]
[642,{"$f":"+_xlfn.CONCAT(\"Trad\",A642)","v":"Trad642"}]
[643,"Trad643"]
[644,"Trad644"]
[645,"Trad645"]
[646,"Trad646"]
[647,"Trad647"]
[648,"Trad648"]
[649,"Trad649"]
[650,"Trad650"]
[651,"Trad651"]
[652,"Trad652"]
[653,"Trad653"]
[654,"Trad654"]
[655,"Trad655"]
[656,"Trad656"]
[657,"Trad657"]
[658,"Trad658"]
[659,"Trad659"]
[660,"Trad660"]
[661,"Trad661"]
[662,"Trad662"]
[663,"Trad663"]
[664,"Trad664"]
[665,"Trad665"]
[666,"Trad666"]
[667,"Trad667"]
[668,"Trad668"]
[669,"Trad669"]
[670,"Trad670"]
[671,"Trad671"]
[672,"Trad672"]
[673,"Trad673"]
[674,"Trad674"]
[675,"Trad675"]
[676,"Trad676"]
[677,"Trad677"]
[678,"Trad678"]
[679,"Trad679"]
[680,"Trad680"]
[681,"Trad681"]
[682,"Trad682"]
[683,"Trad683"]
[684,"Trad684"]
[685,"Trad685"]
[686,"Trad686"]
[687,"Trad687"]
[688,"Trad688"]
[689,"Trad689"]
[690,"Trad690"]
[691,"Trad691"]
[692,"Trad692"]
[693,"Trad693"]
[694,"Trad694"]
[695,"Trad695"]
[696,"Trad696"]
[697,"Trad697"]
[698,"Trad698"]
[699,"Trad699"]
[700,"Trad700"]
[701,"Trad701"]
[702,"Trad702"]
[703,"Trad703"]
[704,"Trad704"]
[705,"Trad705"]
[706,{"$f":"+_xlfn.CONCAT(\"Trad\",A706)","v":"Trad706"}]
[707,"Trad707"]
[708,"Trad708"]
[709,"Trad709"]
[710,"Trad710"]
[711,"Trad711"]
[712,"Trad712"]
[713,"Trad713"]
[714,"Trad714"]
[715,"Trad715"]
[716,"Trad716"]
[717,"Trad717"]
[718,"Trad718"]
[719,"Trad719"]
[720,"Trad720"]
[721,"Trad721"]
[722,"Trad722"]
[723,"Trad723"]
[724,"Trad724"]
[725,"Trad725"]
[726,"Trad726"]
[727,"Trad727"]
[728,"Trad728"]
[729,"Trad729"]
[730,"Trad730"]
[731,"Trad731"]
[732,"Trad732"]
[733,"Trad733"]
[734,"Trad734"]
[735,"Trad735"]
[736,"Trad736"]
[737,"Trad737"]
[738,"Trad738"]
[739,"Trad739"]
[740,"Trad740"]
[741,"Trad741"]
[742,"Trad742"]
[743,"Trad743"]
[744,"Trad744"]
[745,"Trad745"]
[746,"Trad746"]
[747,"Trad747"]
[748,"Trad748"]
[749,"Trad749"]
[750,"Trad750"]
[751,"Trad751"]
[752,"Trad752"]
[753,"Trad753"]
[754,"Trad754"]
[755,"Trad755"]
[756,"Trad756"]
[757,"Trad757"]
[758,"Trad758"]
[759,"Trad759"]
[760,"Trad760"]
[761,"Trad761"]
[762,"Trad762"]
[763,"Trad763"]
[764,"Trad764"]
[765,"Trad765"]
[766,"Trad766"]
[767,"Trad767"]
[768,"Trad768"]
[769,"Trad769"]
[770,{"$f":"+_xlfn.CONCAT(\"Trad\",A770)","v":"Trad770"}]
[771,"Trad771"]
[772,"Trad772"]
[773,"Trad773"]
[774,"Trad774"]
[775,"Trad775"]
[776,"Trad776"]
[777,"Trad777"]
[778,"Trad778"]
[779,"Trad779"]
[780,"Trad780"]
[781,"Trad781"]
[782,"Trad782"]
[783,"Trad783"]
[784,"Trad784"]
[785,"Trad785"]
[786,"Trad786"]
[787,"Trad787"]
[788,"Trad788"]
[789,"Trad789"]
[790,"Trad790"]
[791,"Trad791"]
[792,"Trad792"]
[793,"Trad793"]
[794,"Trad794"]
[795,"Trad795"]
[796,"Trad796"]
[797,"Trad797"]
[798,"Trad798"]
[799,"Trad799"]
[800,"Trad800"]